{"text_format":"1","workbook":"xlsx","n_sheets":10,"sheets":["Skriveni","Upute","RefStr","PR-RAS","BILANCA","RAS-funkcijski","P-VRIO","OBVEZE","Kont","Promjene"],"not_rendered":{"charts":0,"images":0,"macros":1,"external_links":0,"defined_names":13,"comments":0,"pivot_tables":0},"unopened":[],"bounds":{"document_bytes":16777216,"sheet_cells":100000,"rows_first":2000,"rows_last":500,"rows_between":2000,"halvings":0,"cell_chars":16384,"cell_head_chars":4096},"cells_cut":0,"cells_raw":0,"read":"whole","date_system":"1900"}

{"sheet":"Skriveni","index":0,"n_rows":1580,"n_cols":12,"rows_kept":1580,"cut":false,"hidden":true,"merged":[]}
["VP","AOP","IZNOS01","IZNOS02","IZNOS03","IZNOS04","KONTRBR","RAZLIKA","RAZLIKA1","POLJE","TEKST","BROJ"]
[151,1,{"$f":"'PR-RAS'!D6","v":95889.13},{"$f":"'PR-RAS'!E6","v":112184.11},0,0,{"$f":"(B2/1000)*(C2*1+D2*2)","v":320.25734999999997},{"$f":"ABS(C2-ROUND(C2,0))+ABS(D2-ROUND(D2,0))","v":0.24000000000523869},0]
[151,2,{"$f":"'PR-RAS'!D7","v":0},{"$f":"'PR-RAS'!E7","v":0},0,0,0,0,0]
[151,3,{"$f":"'PR-RAS'!D8","v":0},{"$f":"'PR-RAS'!E8","v":0},0,0,0,0,0]
[151,4,{"$f":"'PR-RAS'!D9","v":0},{"$f":"'PR-RAS'!E9","v":0},0,0,0,0,0]
[151,5,{"$f":"'PR-RAS'!D10","v":0},{"$f":"'PR-RAS'!E10","v":0},0,0,0,0,0]
[151,6,{"$f":"'PR-RAS'!D11","v":0},{"$f":"'PR-RAS'!E11","v":0},0,0,0,0,0]
[151,7,{"$f":"'PR-RAS'!D12","v":0},{"$f":"'PR-RAS'!E12","v":0},0,0,0,0,0]
[151,8,{"$f":"'PR-RAS'!D13","v":0},{"$f":"'PR-RAS'!E13","v":0},0,0,0,0,0]
[151,9,{"$f":"'PR-RAS'!D14","v":0},{"$f":"'PR-RAS'!E14","v":0},0,0,0,0,0]
[151,10,{"$f":"'PR-RAS'!D15","v":0},{"$f":"'PR-RAS'!E15","v":0},0,0,0,0,0]
[151,11,{"$f":"'PR-RAS'!D16","v":0},{"$f":"'PR-RAS'!E16","v":0},0,0,0,0,0]
[151,12,{"$f":"'PR-RAS'!D17","v":0},{"$f":"'PR-RAS'!E17","v":0},0,0,0,0,0]
[151,13,{"$f":"'PR-RAS'!D18","v":0},{"$f":"'PR-RAS'!E18","v":0},0,0,0,0,0]
[151,14,{"$f":"'PR-RAS'!D19","v":0},{"$f":"'PR-RAS'!E19","v":0},0,0,0,0,0]
[151,15,{"$f":"'PR-RAS'!D20","v":0},{"$f":"'PR-RAS'!E20","v":0},0,0,0,0,0]
[151,16,{"$f":"'PR-RAS'!D21","v":0},{"$f":"'PR-RAS'!E21","v":0},0,0,0,0,0]
[151,17,{"$f":"'PR-RAS'!D22","v":0},{"$f":"'PR-RAS'!E22","v":0},0,0,0,0,0]
[151,18,{"$f":"'PR-RAS'!D23","v":0},{"$f":"'PR-RAS'!E23","v":0},0,0,0,0,0]
[151,19,{"$f":"'PR-RAS'!D24","v":0},{"$f":"'PR-RAS'!E24","v":0},0,0,0,0,0]
[151,20,{"$f":"'PR-RAS'!D25","v":0},{"$f":"'PR-RAS'!E25","v":0},0,0,0,0,0]
[151,21,{"$f":"'PR-RAS'!D26","v":0},{"$f":"'PR-RAS'!E26","v":0},0,0,0,0,0]
[151,22,{"$f":"'PR-RAS'!D27","v":0},{"$f":"'PR-RAS'!E27","v":0},0,0,0,0,0]
[151,23,{"$f":"'PR-RAS'!D28","v":0},{"$f":"'PR-RAS'!E28","v":0},0,0,0,0,0]
[151,24,{"$f":"'PR-RAS'!D29","v":0},{"$f":"'PR-RAS'!E29","v":0},0,0,0,0,0]
[151,25,{"$f":"'PR-RAS'!D30","v":0},{"$f":"'PR-RAS'!E30","v":0},0,0,0,0,0]
[151,26,{"$f":"'PR-RAS'!D31","v":0},{"$f":"'PR-RAS'!E31","v":0},0,0,0,0,0]
[151,27,{"$f":"'PR-RAS'!D32","v":0},{"$f":"'PR-RAS'!E32","v":0},0,0,0,0,0]
[151,28,{"$f":"'PR-RAS'!D33","v":0},{"$f":"'PR-RAS'!E33","v":0},0,0,0,0,0]
[151,29,{"$f":"'PR-RAS'!D34","v":0},{"$f":"'PR-RAS'!E34","v":0},0,0,0,0,0]
[151,30,{"$f":"'PR-RAS'!D35","v":0},{"$f":"'PR-RAS'!E35","v":0},0,0,0,0,0]
[151,31,{"$f":"'PR-RAS'!D36","v":0},{"$f":"'PR-RAS'!E36","v":0},0,0,0,0,0]
[151,32,{"$f":"'PR-RAS'!D37","v":0},{"$f":"'PR-RAS'!E37","v":0},0,0,0,0,0]
[151,33,{"$f":"'PR-RAS'!D38","v":0},{"$f":"'PR-RAS'!E38","v":0},0,0,0,0,0]
[151,34,{"$f":"'PR-RAS'!D39","v":0},{"$f":"'PR-RAS'!E39","v":0},0,0,0,0,0]
[151,35,{"$f":"'PR-RAS'!D40","v":0},{"$f":"'PR-RAS'!E40","v":0},0,0,0,0,0]
[151,36,{"$f":"'PR-RAS'!D41","v":0},{"$f":"'PR-RAS'!E41","v":0},0,0,0,0,0]
[151,37,{"$f":"'PR-RAS'!D42","v":0},{"$f":"'PR-RAS'!E42","v":0},0,0,0,0,0]
[151,38,{"$f":"'PR-RAS'!D43","v":0},{"$f":"'PR-RAS'!E43","v":0},0,0,0,0,0]
[151,39,{"$f":"'PR-RAS'!D44","v":0},{"$f":"'PR-RAS'!E44","v":0},0,0,0,0,0]
[151,40,{"$f":"'PR-RAS'!D45","v":0},{"$f":"'PR-RAS'!E45","v":0},0,0,0,0,0]
[151,41,{"$f":"'PR-RAS'!D46","v":0},{"$f":"'PR-RAS'!E46","v":0},0,0,0,0,0]
[151,42,{"$f":"'PR-RAS'!D47","v":0},{"$f":"'PR-RAS'!E47","v":0},0,0,0,0,0]
[151,43,{"$f":"'PR-RAS'!D48","v":0},{"$f":"'PR-RAS'!E48","v":0},0,0,0,0,0]
[151,44,{"$f":"'PR-RAS'!D49","v":0},{"$f":"'PR-RAS'!E49","v":0},0,0,0,0,0]
[151,45,{"$f":"'PR-RAS'!D50","v":5308.91},{"$f":"'PR-RAS'!E50","v":8145.3},0,0,971.97795000000008,0.39000000000032742,0]
[151,46,{"$f":"'PR-RAS'!D51","v":0},{"$f":"'PR-RAS'!E51","v":0},0,0,0,0,0]
[151,47,{"$f":"'PR-RAS'!D52","v":0},{"$f":"'PR-RAS'!E52","v":0},0,0,0,0,0]
[151,48,{"$f":"'PR-RAS'!D53","v":0},{"$f":"'PR-RAS'!E53","v":0},0,0,0,0,0]
[151,49,{"$f":"'PR-RAS'!D54","v":0},{"$f":"'PR-RAS'!E54","v":0},0,0,0,0,0]
[151,50,{"$f":"'PR-RAS'!D55","v":0},{"$f":"'PR-RAS'!E55","v":0},0,0,0,0,0]
[151,51,{"$f":"'PR-RAS'!D56","v":0},{"$f":"'PR-RAS'!E56","v":0},0,0,0,0,0]
[151,52,{"$f":"'PR-RAS'!D57","v":0},{"$f":"'PR-RAS'!E57","v":0},0,0,0,0,0]
[151,53,{"$f":"'PR-RAS'!D58","v":0},{"$f":"'PR-RAS'!E58","v":0},0,0,0,0,0]
[151,54,{"$f":"'PR-RAS'!D59","v":0},{"$f":"'PR-RAS'!E59","v":0},0,0,0,0,0]
[151,55,{"$f":"'PR-RAS'!D60","v":0},{"$f":"'PR-RAS'!E60","v":0},0,0,0,0,0]
[151,56,{"$f":"'PR-RAS'!D61","v":0},{"$f":"'PR-RAS'!E61","v":0},0,0,0,0,0]
[151,57,{"$f":"'PR-RAS'!D62","v":0},{"$f":"'PR-RAS'!E62","v":0},0,0,0,0,0]
[151,58,{"$f":"'PR-RAS'!D63","v":0},{"$f":"'PR-RAS'!E63","v":0},0,0,0,0,0]
[151,59,{"$f":"'PR-RAS'!D64","v":0},{"$f":"'PR-RAS'!E64","v":0},0,0,0,0,0]
[151,60,{"$f":"'PR-RAS'!D65","v":0},{"$f":"'PR-RAS'!E65","v":0},0,0,0,0,0]
[151,61,{"$f":"'PR-RAS'!D66","v":0},{"$f":"'PR-RAS'!E66","v":0},0,0,0,0,0]
[151,62,{"$f":"'PR-RAS'!D67","v":0},{"$f":"'PR-RAS'!E67","v":0},0,0,0,0,0]
[151,63,{"$f":"'PR-RAS'!D68","v":5308.91},{"$f":"'PR-RAS'!E68","v":8145.3},0,0,1360.7691300000001,0.39000000000032742,0]
[151,64,{"$f":"'PR-RAS'!D69","v":0},{"$f":"'PR-RAS'!E69","v":0},0,0,0,0,0]
[151,65,{"$f":"'PR-RAS'!D70","v":5308.91},{"$f":"'PR-RAS'!E70","v":8145.3},0,0,1403.9681500000002,0.39000000000032742,0]
[151,66,{"$f":"'PR-RAS'!D71","v":0},{"$f":"'PR-RAS'!E71","v":0},0,0,{"$f":"(B67/1000)*(C67*1+D67*2)","v":0},{"$f":"ABS(C67-ROUND(C67,0))+ABS(D67-ROUND(D67,0))","v":0},0]
[151,67,{"$f":"'PR-RAS'!D72","v":0},{"$f":"'PR-RAS'!E72","v":0},0,0,0,0,0]
[151,68,{"$f":"'PR-RAS'!D73","v":0},{"$f":"'PR-RAS'!E73","v":0},0,0,0,0,0]
[151,69,{"$f":"'PR-RAS'!D74","v":0},{"$f":"'PR-RAS'!E74","v":0},0,0,0,0,0]
[151,70,{"$f":"'PR-RAS'!D75","v":0},{"$f":"'PR-RAS'!E75","v":0},0,0,0,0,0]
[151,71,{"$f":"'PR-RAS'!D76","v":0},{"$f":"'PR-RAS'!E76","v":0},0,0,0,0,0]
[151,72,{"$f":"'PR-RAS'!D77","v":0},{"$f":"'PR-RAS'!E77","v":0},0,0,0,0,0]
[151,73,{"$f":"'PR-RAS'!D78","v":0},{"$f":"'PR-RAS'!E78","v":0},0,0,0,0,0]
[151,74,{"$f":"'PR-RAS'!D79","v":0},{"$f":"'PR-RAS'!E79","v":0},0,0,0,0,0]
[151,75,{"$f":"'PR-RAS'!D80","v":0},{"$f":"'PR-RAS'!E80","v":0},0,0,0,0,0]
[151,76,{"$f":"'PR-RAS'!D81","v":0},{"$f":"'PR-RAS'!E81","v":0},0,0,0,0,0]
[151,77,{"$f":"'PR-RAS'!D82","v":0},{"$f":"'PR-RAS'!E82","v":0},0,0,0,0,0]
[151,78,{"$f":"'PR-RAS'!D83","v":0},{"$f":"'PR-RAS'!E83","v":0},0,0,0,0,0]
[151,79,{"$f":"'PR-RAS'!D84","v":0},{"$f":"'PR-RAS'!E84","v":0},0,0,0,0,0]
[151,80,{"$f":"'PR-RAS'!D85","v":0},{"$f":"'PR-RAS'!E85","v":0},0,0,0,0,0]
[151,81,{"$f":"'PR-RAS'!D86","v":0},{"$f":"'PR-RAS'!E86","v":0},0,0,0,0,0]
[151,82,{"$f":"'PR-RAS'!D87","v":0},{"$f":"'PR-RAS'!E87","v":0},0,0,0,0,0]
[151,83,{"$f":"'PR-RAS'!D88","v":0},{"$f":"'PR-RAS'!E88","v":0},0,0,0,0,0]
[151,84,{"$f":"'PR-RAS'!D89","v":0},{"$f":"'PR-RAS'!E89","v":0},0,0,0,0,0]
[151,85,{"$f":"'PR-RAS'!D90","v":0},{"$f":"'PR-RAS'!E90","v":0},0,0,0,0,0]
[151,86,{"$f":"'PR-RAS'!D91","v":0},{"$f":"'PR-RAS'!E91","v":0},0,0,0,0,0]
[151,87,{"$f":"'PR-RAS'!D92","v":0},{"$f":"'PR-RAS'!E92","v":0},0,0,0,0,0]
[151,88,{"$f":"'PR-RAS'!D93","v":0},{"$f":"'PR-RAS'!E93","v":0},0,0,0,0,0]
[151,89,{"$f":"'PR-RAS'!D94","v":0},{"$f":"'PR-RAS'!E94","v":0},0,0,0,0,0]
[151,90,{"$f":"'PR-RAS'!D95","v":0},{"$f":"'PR-RAS'!E95","v":0},0,0,0,0,0]
[151,91,{"$f":"'PR-RAS'!D96","v":0},{"$f":"'PR-RAS'!E96","v":0},0,0,0,0,0]
[151,92,{"$f":"'PR-RAS'!D97","v":0},{"$f":"'PR-RAS'!E97","v":0},0,0,0,0,0]
[151,93,{"$f":"'PR-RAS'!D98","v":0},{"$f":"'PR-RAS'!E98","v":0},0,0,0,0,0]
[151,94,{"$f":"'PR-RAS'!D99","v":0},{"$f":"'PR-RAS'!E99","v":0},0,0,0,0,0]
[151,95,{"$f":"'PR-RAS'!D100","v":0},{"$f":"'PR-RAS'!E100","v":0},0,0,0,0,0]
[151,96,{"$f":"'PR-RAS'!D101","v":0},{"$f":"'PR-RAS'!E101","v":0},0,0,0,0,0]
[151,97,{"$f":"'PR-RAS'!D102","v":0},{"$f":"'PR-RAS'!E102","v":0},0,0,0,0,0]
[151,98,{"$f":"'PR-RAS'!D103","v":0},{"$f":"'PR-RAS'!E103","v":0},0,0,0,0,0]
[151,99,{"$f":"'PR-RAS'!D104","v":0},{"$f":"'PR-RAS'!E104","v":0},0,0,0,0,0]
[151,100,{"$f":"'PR-RAS'!D105","v":0},{"$f":"'PR-RAS'!E105","v":0},0,0,0,0,0]
[151,101,{"$f":"'PR-RAS'!D106","v":1101.1300000000001},{"$f":"'PR-RAS'!E106","v":1060.07},0,0,325.34827000000001,0.20000000000004547,0]
[151,102,{"$f":"'PR-RAS'!D107","v":0},{"$f":"'PR-RAS'!E107","v":0},0,0,0,0,0]
[151,103,{"$f":"'PR-RAS'!D108","v":0},{"$f":"'PR-RAS'!E108","v":0},0,0,0,0,0]
[151,104,{"$f":"'PR-RAS'!D109","v":0},{"$f":"'PR-RAS'!E109","v":0},0,0,0,0,0]
[151,105,{"$f":"'PR-RAS'!D110","v":0},{"$f":"'PR-RAS'!E110","v":0},0,0,0,0,0]
[151,106,{"$f":"'PR-RAS'!D111","v":0},{"$f":"'PR-RAS'!E111","v":0},0,0,0,0,0]
[151,107,{"$f":"'PR-RAS'!D112","v":1101.1300000000001},{"$f":"'PR-RAS'!E112","v":1060.07},0,0,344.67588999999998,0.20000000000004547,0]
[151,108,{"$f":"'PR-RAS'!D113","v":0},{"$f":"'PR-RAS'!E113","v":0},0,0,0,0,0]
[151,109,{"$f":"'PR-RAS'!D114","v":0},{"$f":"'PR-RAS'!E114","v":0},0,0,0,0,0]
[151,110,{"$f":"'PR-RAS'!D115","v":0},{"$f":"'PR-RAS'!E115","v":0},0,0,0,0,0]
[151,111,{"$f":"'PR-RAS'!D116","v":0},{"$f":"'PR-RAS'!E116","v":0},0,0,0,0,0]
[151,112,{"$f":"'PR-RAS'!D117","v":1101.1300000000001},{"$f":"'PR-RAS'!E117","v":1060.07},0,0,360.78224,0.20000000000004547,0]
[151,113,{"$f":"'PR-RAS'!D118","v":0},{"$f":"'PR-RAS'!E118","v":0},0,0,0,0,0]
[151,114,{"$f":"'PR-RAS'!D119","v":0},{"$f":"'PR-RAS'!E119","v":0},0,0,0,0,0]
[151,115,{"$f":"'PR-RAS'!D120","v":0},{"$f":"'PR-RAS'!E120","v":0},0,0,0,0,0]
[151,116,{"$f":"'PR-RAS'!D121","v":0},{"$f":"'PR-RAS'!E121","v":0},0,0,0,0,0]
[151,117,{"$f":"'PR-RAS'!D122","v":0},{"$f":"'PR-RAS'!E122","v":0},0,0,0,0,0]
[151,118,{"$f":"'PR-RAS'!D123","v":0},{"$f":"'PR-RAS'!E123","v":0},0,0,0,0,0]
[151,119,{"$f":"'PR-RAS'!D124","v":564.90000000000009},{"$f":"'PR-RAS'!E124","v":6599.18},0,0,1637.8279399999999,0.28000000000020009,0]
[151,120,{"$f":"'PR-RAS'!D125","v":351.72},{"$f":"'PR-RAS'!E125","v":191.18},0,0,88.089600000000004,0.45999999999997954,0]
[151,121,{"$f":"'PR-RAS'!D126","v":351.72},{"$f":"'PR-RAS'!E126","v":191.18},0,0,88.823679999999996,0.45999999999997954,0]
[151,122,{"$f":"'PR-RAS'!D127","v":0},{"$f":"'PR-RAS'!E127","v":0},0,0,0,0,0]
[151,123,{"$f":"'PR-RAS'!D128","v":213.18},{"$f":"'PR-RAS'!E128","v":6408},0,0,1602.58914,0.18000000000000682,0]
[151,124,{"$f":"'PR-RAS'!D129","v":213.18},{"$f":"'PR-RAS'!E129","v":0},0,0,26.43432,0.18000000000000682,0]
[151,125,{"$f":"'PR-RAS'!D130","v":0},{"$f":"'PR-RAS'!E130","v":6408},0,0,1602,0,0]
[151,126,{"$f":"'PR-RAS'!D131","v":0},{"$f":"'PR-RAS'!E131","v":0},0,0,{"$f":"(B127/1000)*(C127*1+D127*2)","v":0},{"$f":"ABS(C127-ROUND(C127,0))+ABS(D127-ROUND(D127,0))","v":0},0]
[151,127,{"$f":"'PR-RAS'!D132","v":0},{"$f":"'PR-RAS'!E132","v":0},0,0,0,0,0]
[151,128,{"$f":"'PR-RAS'!D133","v":88783.72},{"$f":"'PR-RAS'!E133","v":96379.56},0,0,36037.483519999994,0.72000000000116415,0]
[151,129,{"$f":"'PR-RAS'!D134","v":88783.72},{"$f":"'PR-RAS'!E134","v":96379.56},0,0,36319.026359999996,0.72000000000116415,0]
[151,130,{"$f":"'PR-RAS'!D135","v":77616.850000000006},{"$f":"'PR-RAS'!E135","v":86858.01},0,0,32673.273100000002,0.15999999998894054,0]
[151,131,{"$f":"'PR-RAS'!D136","v":11166.87},{"$f":"'PR-RAS'!E136","v":9521.5499999999993},0,0,3957.5060700000004,0.57999999999992724,0]
[151,132,{"$f":"'PR-RAS'!D137","v":0},{"$f":"'PR-RAS'!E137","v":0},0,0,0,0,0]
[151,133,{"$f":"'PR-RAS'!D138","v":0},{"$f":"'PR-RAS'!E138","v":0},0,0,0,0,0]
[151,134,{"$f":"'PR-RAS'!D139","v":130.47},{"$f":"'PR-RAS'!E139","v":0},0,0,17.482980000000001,0.46999999999999886,0]
[151,135,{"$f":"'PR-RAS'!D140","v":0},{"$f":"'PR-RAS'!E140","v":0},0,0,0,0,0]
[151,136,{"$f":"'PR-RAS'!D141","v":0},{"$f":"'PR-RAS'!E141","v":0},0,0,0,0,0]
[151,137,{"$f":"'PR-RAS'!D142","v":0},{"$f":"'PR-RAS'!E142","v":0},0,0,0,0,0]
[151,138,{"$f":"'PR-RAS'!D143","v":0},{"$f":"'PR-RAS'!E143","v":0},0,0,0,0,0]
[151,139,{"$f":"'PR-RAS'!D144","v":0},{"$f":"'PR-RAS'!E144","v":0},0,0,0,0,0]
[151,140,{"$f":"'PR-RAS'!D145","v":0},{"$f":"'PR-RAS'!E145","v":0},0,0,0,0,0]
[151,141,{"$f":"'PR-RAS'!D146","v":0},{"$f":"'PR-RAS'!E146","v":0},0,0,0,0,0]
[151,142,{"$f":"'PR-RAS'!D147","v":0},{"$f":"'PR-RAS'!E147","v":0},0,0,0,0,0]
[151,143,{"$f":"'PR-RAS'!D148","v":0},{"$f":"'PR-RAS'!E148","v":0},0,0,0,0,0]
[151,144,{"$f":"'PR-RAS'!D149","v":0},{"$f":"'PR-RAS'!E149","v":0},0,0,0,0,0]
[151,145,{"$f":"'PR-RAS'!D150","v":130.47},{"$f":"'PR-RAS'!E150","v":0},0,0,18.918149999999997,0.46999999999999886,0]
[151,146,{"$f":"'PR-RAS'!D151","v":77222.87000000001},{"$f":"'PR-RAS'!E151","v":87498.09},0,0,36823.981299999999,0.21999999998661224,0]
[151,147,{"$f":"'PR-RAS'!D152","v":53351.380000000005},{"$f":"'PR-RAS'!E152","v":58213.299999999996},0,0,24957.363059999996,0.68000000000029104,0]
[151,148,{"$f":"'PR-RAS'!D153","v":42510.22},{"$f":"'PR-RAS'!E153","v":46461.22},0,0,20044.03368,0.44000000000232831,0]
[151,149,{"$f":"'PR-RAS'!D154","v":42510.22},{"$f":"'PR-RAS'!E154","v":46461.22},0,0,20179.466339999999,0.44000000000232831,0]
[151,150,{"$f":"'PR-RAS'!D155","v":0},{"$f":"'PR-RAS'!E155","v":0},0,0,0,0,0]
[151,151,{"$f":"'PR-RAS'!D156","v":0},{"$f":"'PR-RAS'!E156","v":0},0,0,0,0,0]
[151,152,{"$f":"'PR-RAS'!D157","v":0},{"$f":"'PR-RAS'!E157","v":0},0,0,0,0,0]
[151,153,{"$f":"'PR-RAS'!D158","v":3826.97},{"$f":"'PR-RAS'!E158","v":4085.95},0,0,1835.8271099999997,8.0000000000381988E-2,0]
[151,154,{"$f":"'PR-RAS'!D159","v":7014.19},{"$f":"'PR-RAS'!E159","v":7666.13},0,0,3441.3533000000002,0.31999999999970896,0]
[151,155,{"$f":"'PR-RAS'!D160","v":0},{"$f":"'PR-RAS'!E160","v":0},0,0,0,0,0]
[151,156,{"$f":"'PR-RAS'!D161","v":7014.19},{"$f":"'PR-RAS'!E161","v":7666.13},0,0,3486.0462000000002,0.31999999999970896,0]
[151,157,{"$f":"'PR-RAS'!D162","v":0},{"$f":"'PR-RAS'!E162","v":0},0,0,0,0,0]
[151,158,{"$f":"'PR-RAS'!D163","v":23871.49},{"$f":"'PR-RAS'!E163","v":29284.79},0,0,13025.689060000001,0.7000000000007276,0]
[151,159,{"$f":"'PR-RAS'!D164","v":2283.9100000000003},{"$f":"'PR-RAS'!E164","v":4141.75},0,0,1680.21819,0.33999999999969077,0]
[151,160,{"$f":"'PR-RAS'!D165","v":505.42},{"$f":"'PR-RAS'!E165","v":2188.65},0,0,781.23520000000008,0.76999999999992497,0]
[151,161,{"$f":"'PR-RAS'!D166","v":1639.13},{"$f":"'PR-RAS'!E166","v":1815.6},0,0,848.52313000000004,0.53000000000020009,0]
[151,162,{"$f":"'PR-RAS'!D167","v":139.36000000000001},{"$f":"'PR-RAS'!E167","v":137.5},0,0,67.126320000000007,0.86000000000001364,0]
[151,163,{"$f":"'PR-RAS'!D168","v":0},{"$f":"'PR-RAS'!E168","v":0},0,0,0,0,0]
[151,164,{"$f":"'PR-RAS'!D169","v":6432},{"$f":"'PR-RAS'!E169","v":5750.23},0,0,2940.92344,0.22999999999956344,0]
[151,165,{"$f":"'PR-RAS'!D170","v":2668.93},{"$f":"'PR-RAS'!E170","v":2538.23},0,0,1277.9893500000001,0.3000000000001819,0]
[151,166,{"$f":"'PR-RAS'!D171","v":0},{"$f":"'PR-RAS'!E171","v":0},0,0,0,0,0]
[151,167,{"$f":"'PR-RAS'!D172","v":3658.83},{"$f":"'PR-RAS'!E172","v":3062.02},0,0,1633.73929,0.19000000000005457,0]
[151,168,{"$f":"'PR-RAS'!D173","v":0},{"$f":"'PR-RAS'!E173","v":0},0,0,0,0,0]
[151,169,{"$f":"'PR-RAS'!D174","v":104.24},{"$f":"'PR-RAS'!E174","v":149.97999999999999},0,0,68.309799999999996,0.26000000000000512,0]
[151,170,{"$f":"'PR-RAS'!D175","v":0},{"$f":"'PR-RAS'!E175","v":0},0,0,0,0,0]
[151,171,{"$f":"'PR-RAS'!D176","v":0},{"$f":"'PR-RAS'!E176","v":0},0,0,0,0,0]
[151,172,{"$f":"'PR-RAS'!D177","v":12956.61},{"$f":"'PR-RAS'!E177","v":17095.23},0,0,8109.2960399999993,0.61999999999898137,0]
[151,173,{"$f":"'PR-RAS'!D178","v":530.24},{"$f":"'PR-RAS'!E178","v":616.73},0,0,305.12009999999998,0.50999999999999091,0]
[151,174,{"$f":"'PR-RAS'!D179","v":2405.59},{"$f":"'PR-RAS'!E179","v":2586.9},0,0,1318.81386,0.50999999999976353,0]
[151,175,{"$f":"'PR-RAS'!D180","v":2013.52},{"$f":"'PR-RAS'!E180","v":320},0,0,464.36599999999999,0.48000000000001819,0]
[151,176,{"$f":"'PR-RAS'!D181","v":585},{"$f":"'PR-RAS'!E181","v":482.66},0,0,272.85632000000004,0.33999999999997499,0]
[151,177,{"$f":"'PR-RAS'!D182","v":0},{"$f":"'PR-RAS'!E182","v":727.92},0,0,257.68367999999998,8.0000000000040927E-2,0]
[151,178,{"$f":"'PR-RAS'!D183","v":0},{"$f":"'PR-RAS'!E183","v":0},0,0,0,0,0]
[151,179,{"$f":"'PR-RAS'!D184","v":3522.57},{"$f":"'PR-RAS'!E184","v":8599.98},0,0,3709.3328699999997,0.45000000000027285,0]
[151,180,{"$f":"'PR-RAS'!D185","v":2285.4899999999998},{"$f":"'PR-RAS'!E185","v":2595.5},0,0,1345.7682,0.98999999999978172,0]
[151,181,{"$f":"'PR-RAS'!D186","v":1614.2},{"$f":"'PR-RAS'!E186","v":1165.54},0,0,714.0956799999999,0.66000000000008185,0]
[151,182,{"$f":"'PR-RAS'!D187","v":0},{"$f":"'PR-RAS'!E187","v":0},0,0,0,0,0]
[151,183,{"$f":"'PR-RAS'!D188","v":2198.9700000000003},{"$f":"'PR-RAS'!E188","v":2297.58},0,0,1243.3257900000001,0.4499999999998181,0]
[151,184,{"$f":"'PR-RAS'!D189","v":0},{"$f":"'PR-RAS'!E189","v":0},0,0,0,0,0]
[151,185,{"$f":"'PR-RAS'!D190","v":1534.69},{"$f":"'PR-RAS'!E190","v":1779.55},0,0,942.35114999999996,0.75999999999999091,0]
[151,186,{"$f":"'PR-RAS'!D191","v":664.28},{"$f":"'PR-RAS'!E191","v":518.03},0,0,316.26324,0.30999999999994543,0]
[151,187,{"$f":"'PR-RAS'!D192","v":0},{"$f":"'PR-RAS'!E192","v":0},0,0,0,0,0]
[151,188,{"$f":"'PR-RAS'!D193","v":0},{"$f":"'PR-RAS'!E193","v":0},0,0,0,0,0]
[151,189,{"$f":"'PR-RAS'!D194","v":0},{"$f":"'PR-RAS'!E194","v":0},0,0,0,0,0]
[151,190,{"$f":"'PR-RAS'!D195","v":0},{"$f":"'PR-RAS'!E195","v":0},0,0,0,0,0]
[151,191,{"$f":"'PR-RAS'!D196","v":0},{"$f":"'PR-RAS'!E196","v":0},0,0,0,0,0]
[151,192,{"$f":"'PR-RAS'!D197","v":0},{"$f":"'PR-RAS'!E197","v":0},0,0,0,0,0]
[151,193,{"$f":"'PR-RAS'!D198","v":0},{"$f":"'PR-RAS'!E198","v":0},0,0,0,0,0]
[151,194,{"$f":"'PR-RAS'!D199","v":0},{"$f":"'PR-RAS'!E199","v":0},0,0,0,0,0]
[151,195,{"$f":"'PR-RAS'!D200","v":0},{"$f":"'PR-RAS'!E200","v":0},0,0,0,0,0]
[151,196,{"$f":"'PR-RAS'!D201","v":0},{"$f":"'PR-RAS'!E201","v":0},0,0,0,0,0]
[151,197,{"$f":"'PR-RAS'!D202","v":0},{"$f":"'PR-RAS'!E202","v":0},0,0,0,0,0]
[151,198,{"$f":"'PR-RAS'!D203","v":0},{"$f":"'PR-RAS'!E203","v":0},0,0,0,0,0]
[151,199,{"$f":"'PR-RAS'!D204","v":0},{"$f":"'PR-RAS'!E204","v":0},0,0,0,0,0]
[151,200,{"$f":"'PR-RAS'!D205","v":0},{"$f":"'PR-RAS'!E205","v":0},0,0,0,0,0]
[151,201,{"$f":"'PR-RAS'!D206","v":0},{"$f":"'PR-RAS'!E206","v":0},0,0,0,0,0]
[151,202,{"$f":"'PR-RAS'!D207","v":0},{"$f":"'PR-RAS'!E207","v":0},0,0,0,0,0]
[151,203,{"$f":"'PR-RAS'!D208","v":0},{"$f":"'PR-RAS'!E208","v":0},0,0,0,0,0]
[151,204,{"$f":"'PR-RAS'!D209","v":0},{"$f":"'PR-RAS'!E209","v":0},0,0,0,0,0]
[151,205,{"$f":"'PR-RAS'!D210","v":0},{"$f":"'PR-RAS'!E210","v":0},0,0,0,0,0]
[151,206,{"$f":"'PR-RAS'!D211","v":0},{"$f":"'PR-RAS'!E211","v":0},0,0,0,0,0]
[151,207,{"$f":"'PR-RAS'!D212","v":0},{"$f":"'PR-RAS'!E212","v":0},0,0,0,0,0]
[151,208,{"$f":"'PR-RAS'!D213","v":0},{"$f":"'PR-RAS'!E213","v":0},0,0,0,0,0]
[151,209,{"$f":"'PR-RAS'!D214","v":0},{"$f":"'PR-RAS'!E214","v":0},0,0,0,0,0]
[151,210,{"$f":"'PR-RAS'!D215","v":0},{"$f":"'PR-RAS'!E215","v":0},0,0,0,0,0]
[151,211,{"$f":"'PR-RAS'!D216","v":0},{"$f":"'PR-RAS'!E216","v":0},0,0,0,0,0]
[151,212,{"$f":"'PR-RAS'!D217","v":0},{"$f":"'PR-RAS'!E217","v":0},0,0,0,0,0]
[151,213,{"$f":"'PR-RAS'!D218","v":0},{"$f":"'PR-RAS'!E218","v":0},0,0,0,0,0]
[151,214,{"$f":"'PR-RAS'!D219","v":0},{"$f":"'PR-RAS'!E219","v":0},0,0,0,0,0]
[151,215,{"$f":"'PR-RAS'!D220","v":0},{"$f":"'PR-RAS'!E220","v":0},0,0,0,0,0]
[151,216,{"$f":"'PR-RAS'!D221","v":0},{"$f":"'PR-RAS'!E221","v":0},0,0,0,0,0]
[151,217,{"$f":"'PR-RAS'!D222","v":0},{"$f":"'PR-RAS'!E222","v":0},0,0,0,0,0]
[151,218,{"$f":"'PR-RAS'!D223","v":0},{"$f":"'PR-RAS'!E223","v":0},0,0,0,0,0]
[151,219,{"$f":"'PR-RAS'!D224","v":0},{"$f":"'PR-RAS'!E224","v":0},0,0,0,0,0]
[151,220,{"$f":"'PR-RAS'!D225","v":0},{"$f":"'PR-RAS'!E225","v":0},0,0,0,0,0]
[151,221,{"$f":"'PR-RAS'!D226","v":0},{"$f":"'PR-RAS'!E226","v":0},0,0,0,0,0]
[151,222,{"$f":"'PR-RAS'!D227","v":0},{"$f":"'PR-RAS'!E227","v":0},0,0,0,0,0]
[151,223,{"$f":"'PR-RAS'!D228","v":0},{"$f":"'PR-RAS'!E228","v":0},0,0,0,0,0]
[151,224,{"$f":"'PR-RAS'!D229","v":0},{"$f":"'PR-RAS'!E229","v":0},0,0,0,0,0]
[151,225,{"$f":"'PR-RAS'!D230","v":0},{"$f":"'PR-RAS'!E230","v":0},0,0,0,0,0]
[151,226,{"$f":"'PR-RAS'!D231","v":0},{"$f":"'PR-RAS'!E231","v":0},0,0,0,0,0]
[151,227,{"$f":"'PR-RAS'!D232","v":0},{"$f":"'PR-RAS'!E232","v":0},0,0,0,0,0]
[151,228,{"$f":"'PR-RAS'!D233","v":0},{"$f":"'PR-RAS'!E233","v":0},0,0,0,0,0]
[151,229,{"$f":"'PR-RAS'!D234","v":0},{"$f":"'PR-RAS'!E234","v":0},0,0,{"$f":"(B230/1000)*(C230*1+D230*2)","v":0},{"$f":"ABS(C230-ROUND(C230,0))+ABS(D230-ROUND(D230,0))","v":0},0]
[151,230,{"$f":"'PR-RAS'!D235","v":0},{"$f":"'PR-RAS'!E235","v":0},0,0,0,0,0]
[151,231,{"$f":"'PR-RAS'!D236","v":0},{"$f":"'PR-RAS'!E236","v":0},0,0,0,0,0]
[151,232,{"$f":"'PR-RAS'!D237","v":0},{"$f":"'PR-RAS'!E237","v":0},0,0,0,0,0]
[151,233,{"$f":"'PR-RAS'!D238","v":0},{"$f":"'PR-RAS'!E238","v":0},0,0,0,0,0]
[151,234,{"$f":"'PR-RAS'!D239","v":0},{"$f":"'PR-RAS'!E239","v":0},0,0,{"$f":"(B235/1000)*(C235*1+D235*2)","v":0},{"$f":"ABS(C235-ROUND(C235,0))+ABS(D235-ROUND(D235,0))","v":0},0]
[151,235,{"$f":"'PR-RAS'!D240","v":0},{"$f":"'PR-RAS'!E240","v":0},0,0,0,0,0]
[151,236,{"$f":"'PR-RAS'!D241","v":0},{"$f":"'PR-RAS'!E241","v":0},0,0,0,0,0]
[151,237,{"$f":"'PR-RAS'!D242","v":0},{"$f":"'PR-RAS'!E242","v":0},0,0,0,0,0]
[151,238,{"$f":"'PR-RAS'!D243","v":0},{"$f":"'PR-RAS'!E243","v":0},0,0,0,0,0]
[151,239,{"$f":"'PR-RAS'!D244","v":0},{"$f":"'PR-RAS'!E244","v":0},0,0,0,0,0]
[151,240,{"$f":"'PR-RAS'!D245","v":0},{"$f":"'PR-RAS'!E245","v":0},0,0,0,0,0]
[151,241,{"$f":"'PR-RAS'!D246","v":0},{"$f":"'PR-RAS'!E246","v":0},0,0,0,0,0]
[151,242,{"$f":"'PR-RAS'!D247","v":0},{"$f":"'PR-RAS'!E247","v":0},0,0,0,0,0]
[151,243,{"$f":"'PR-RAS'!D248","v":0},{"$f":"'PR-RAS'!E248","v":0},0,0,0,0,0]
[151,244,{"$f":"'PR-RAS'!D249","v":0},{"$f":"'PR-RAS'!E249","v":0},0,0,0,0,0]
[151,245,{"$f":"'PR-RAS'!D250","v":0},{"$f":"'PR-RAS'!E250","v":0},0,0,0,0,0]
[151,246,{"$f":"'PR-RAS'!D251","v":0},{"$f":"'PR-RAS'!E251","v":0},0,0,0,0,0]
[151,247,{"$f":"'PR-RAS'!D252","v":0},{"$f":"'PR-RAS'!E252","v":0},0,0,0,0,0]
[151,248,{"$f":"'PR-RAS'!D253","v":0},{"$f":"'PR-RAS'!E253","v":0},0,0,0,0,0]
[151,249,{"$f":"'PR-RAS'!D254","v":0},{"$f":"'PR-RAS'!E254","v":0},0,0,0,0,0]
[151,250,{"$f":"'PR-RAS'!D255","v":0},{"$f":"'PR-RAS'!E255","v":0},0,0,0,0,0]
[151,251,{"$f":"'PR-RAS'!D256","v":0},{"$f":"'PR-RAS'!E256","v":0},0,0,0,0,0]
[151,252,{"$f":"'PR-RAS'!D257","v":0},{"$f":"'PR-RAS'!E257","v":0},0,0,0,0,0]
[151,253,{"$f":"'PR-RAS'!D258","v":0},{"$f":"'PR-RAS'!E258","v":0},0,0,0,0,0]
[151,254,{"$f":"'PR-RAS'!D259","v":0},{"$f":"'PR-RAS'!E259","v":0},0,0,0,0,0]
[151,255,{"$f":"'PR-RAS'!D260","v":0},{"$f":"'PR-RAS'!E260","v":0},0,0,0,0,0]
[151,256,{"$f":"'PR-RAS'!D261","v":0},{"$f":"'PR-RAS'!E261","v":0},0,0,0,0,0]
[151,257,{"$f":"'PR-RAS'!D262","v":0},{"$f":"'PR-RAS'!E262","v":0},0,0,0,0,0]
[151,258,{"$f":"'PR-RAS'!D263","v":0},{"$f":"'PR-RAS'!E263","v":0},0,0,0,0,0]
[151,259,{"$f":"'PR-RAS'!D264","v":0},{"$f":"'PR-RAS'!E264","v":0},0,0,0,0,0]
[151,260,{"$f":"'PR-RAS'!D265","v":0},{"$f":"'PR-RAS'!E265","v":0},0,0,0,0,0]
[151,261,{"$f":"'PR-RAS'!D266","v":0},{"$f":"'PR-RAS'!E266","v":0},0,0,0,0,0]
[151,262,{"$f":"'PR-RAS'!D267","v":0},{"$f":"'PR-RAS'!E267","v":0},0,0,0,0,0]
[151,263,{"$f":"'PR-RAS'!D268","v":0},{"$f":"'PR-RAS'!E268","v":0},0,0,0,0,0]
[151,264,{"$f":"'PR-RAS'!D269","v":0},{"$f":"'PR-RAS'!E269","v":0},0,0,{"$f":"(B265/1000)*(C265*1+D265*2)","v":0},{"$f":"ABS(C265-ROUND(C265,0))+ABS(D265-ROUND(D265,0))","v":0},0]
[151,265,{"$f":"'PR-RAS'!D270","v":0},{"$f":"'PR-RAS'!E270","v":0},0,0,0,0,0]
[151,266,{"$f":"'PR-RAS'!D271","v":0},{"$f":"'PR-RAS'!E271","v":0},0,0,0,0,0]
[151,267,{"$f":"'PR-RAS'!D272","v":0},{"$f":"'PR-RAS'!E272","v":0},0,0,{"$f":"(B268/1000)*(C268*1+D268*2)","v":0},{"$f":"ABS(C268-ROUND(C268,0))+ABS(D268-ROUND(D268,0))","v":0},0]
[151,268,{"$f":"'PR-RAS'!D273","v":0},{"$f":"'PR-RAS'!E273","v":0},0,0,0,0,0]
[151,269,{"$f":"'PR-RAS'!D274","v":0},{"$f":"'PR-RAS'!E274","v":0},0,0,0,0,0]
[151,270,{"$f":"'PR-RAS'!D275","v":0},{"$f":"'PR-RAS'!E275","v":0},0,0,0,0,0]
[151,271,{"$f":"'PR-RAS'!D276","v":0},{"$f":"'PR-RAS'!E276","v":0},0,0,0,0,0]
[151,272,{"$f":"'PR-RAS'!D277","v":0},{"$f":"'PR-RAS'!E277","v":0},0,0,0,0,0]
[151,273,{"$f":"'PR-RAS'!D278","v":0},{"$f":"'PR-RAS'!E278","v":0},0,0,0,0,0]
[151,274,{"$f":"'PR-RAS'!D279","v":0},{"$f":"'PR-RAS'!E279","v":0},0,0,0,0,0]
[151,275,{"$f":"'PR-RAS'!D280","v":0},{"$f":"'PR-RAS'!E280","v":0},0,0,0,0,0]
[151,276,{"$f":"'PR-RAS'!D281","v":0},{"$f":"'PR-RAS'!E281","v":0},0,0,0,0,0]
[151,277,{"$f":"'PR-RAS'!D282","v":0},{"$f":"'PR-RAS'!E282","v":0},0,0,0,0,0]
[151,278,{"$f":"'PR-RAS'!D283","v":0},{"$f":"'PR-RAS'!E283","v":0},0,0,0,0,0]
[151,279,{"$f":"'PR-RAS'!D284","v":0},{"$f":"'PR-RAS'!E284","v":0},0,0,{"$f":"(B280/1000)*(C280*1+D280*2)","v":0},{"$f":"ABS(C280-ROUND(C280,0))+ABS(D280-ROUND(D280,0))","v":0},0]
[151,280,{"$f":"'PR-RAS'!D285","v":0},{"$f":"'PR-RAS'!E285","v":0},0,0,0,0,0]
[151,281,{"$f":"'PR-RAS'!D286","v":0},{"$f":"'PR-RAS'!E286","v":0},0,0,0,0,0]
[151,282,{"$f":"'PR-RAS'!D287","v":0},{"$f":"'PR-RAS'!E287","v":0},0,0,0,0,0]
[151,283,{"$f":"'PR-RAS'!D288","v":0},{"$f":"'PR-RAS'!E288","v":0},0,0,0,0,0]
[151,284,{"$f":"'PR-RAS'!D289","v":77222.87000000001},{"$f":"'PR-RAS'!E289","v":87498.09},0,0,71630.210199999987,0.21999999998661224,0]
[151,285,{"$f":"'PR-RAS'!D290","v":18666.259999999995},{"$f":"'PR-RAS'!E290","v":24686.020000000004},0,0,19390.915499999999,0.27999999999883585,0]
[151,286,{"$f":"'PR-RAS'!D291","v":0},{"$f":"'PR-RAS'!E291","v":0},0,0,0,0,0]
[151,287,{"$f":"'PR-RAS'!D292","v":5118.34},{"$f":"'PR-RAS'!E292","v":6527.57},0,0,5215.7887599999995,0.77000000000043656,0]
[151,288,{"$f":"'PR-RAS'!D293","v":0},{"$f":"'PR-RAS'!E293","v":0},0,0,0,0,0]
[151,289,{"$f":"'PR-RAS'!D294","v":36.5},{"$f":"'PR-RAS'!E294","v":7.3},0,0,14.767899999999999,0.79999999999999982,0]
[151,290,{"$f":"'PR-RAS'!D295","v":36.5},{"$f":"'PR-RAS'!E295","v":7.3},0,0,14.818999999999999,0.79999999999999982,0]
[151,291,{"$f":"'PR-RAS'!D296","v":0},{"$f":"'PR-RAS'!E296","v":0},0,0,0,0,0]
[151,292,{"$f":"'PR-RAS'!D298","v":0},{"$f":"'PR-RAS'!E298","v":0},0,0,0,0,0]
[151,293,{"$f":"'PR-RAS'!D299","v":0},{"$f":"'PR-RAS'!E299","v":0},0,0,0,0,0]
[151,294,{"$f":"'PR-RAS'!D300","v":0},{"$f":"'PR-RAS'!E300","v":0},0,0,0,0,0]
[151,295,{"$f":"'PR-RAS'!D301","v":0},{"$f":"'PR-RAS'!E301","v":0},0,0,0,0,0]
[151,296,{"$f":"'PR-RAS'!D302","v":0},{"$f":"'PR-RAS'!E302","v":0},0,0,0,0,0]
[151,297,{"$f":"'PR-RAS'!D303","v":0},{"$f":"'PR-RAS'!E303","v":0},0,0,0,0,0]
[151,298,{"$f":"'PR-RAS'!D304","v":0},{"$f":"'PR-RAS'!E304","v":0},0,0,0,0,0]
[151,299,{"$f":"'PR-RAS'!D305","v":0},{"$f":"'PR-RAS'!E305","v":0},0,0,0,0,0]
[151,300,{"$f":"'PR-RAS'!D306","v":0},{"$f":"'PR-RAS'!E306","v":0},0,0,0,0,0]
[151,301,{"$f":"'PR-RAS'!D307","v":0},{"$f":"'PR-RAS'!E307","v":0},0,0,0,0,0]
[151,302,{"$f":"'PR-RAS'!D308","v":0},{"$f":"'PR-RAS'!E308","v":0},0,0,0,0,0]
[151,303,{"$f":"'PR-RAS'!D309","v":0},{"$f":"'PR-RAS'!E309","v":0},0,0,0,0,0]
[151,304,{"$f":"'PR-RAS'!D310","v":0},{"$f":"'PR-RAS'!E310","v":0},0,0,0,0,0]
[151,305,{"$f":"'PR-RAS'!D311","v":0},{"$f":"'PR-RAS'!E311","v":0},0,0,0,0,0]
[151,306,{"$f":"'PR-RAS'!D312","v":0},{"$f":"'PR-RAS'!E312","v":0},0,0,0,0,0]
[151,307,{"$f":"'PR-RAS'!D313","v":0},{"$f":"'PR-RAS'!E313","v":0},0,0,0,0,0]
[151,308,{"$f":"'PR-RAS'!D314","v":0},{"$f":"'PR-RAS'!E314","v":0},0,0,0,0,0]
[151,309,{"$f":"'PR-RAS'!D315","v":0},{"$f":"'PR-RAS'!E315","v":0},0,0,0,0,0]
[151,310,{"$f":"'PR-RAS'!D316","v":0},{"$f":"'PR-RAS'!E316","v":0},0,0,0,0,0]
[151,311,{"$f":"'PR-RAS'!D317","v":0},{"$f":"'PR-RAS'!E317","v":0},0,0,0,0,0]
[151,312,{"$f":"'PR-RAS'!D318","v":0},{"$f":"'PR-RAS'!E318","v":0},0,0,0,0,0]
[151,313,{"$f":"'PR-RAS'!D319","v":0},{"$f":"'PR-RAS'!E319","v":0},0,0,0,0,0]
[151,314,{"$f":"'PR-RAS'!D320","v":0},{"$f":"'PR-RAS'!E320","v":0},0,0,0,0,0]
[151,315,{"$f":"'PR-RAS'!D321","v":0},{"$f":"'PR-RAS'!E321","v":0},0,0,0,0,0]
[151,316,{"$f":"'PR-RAS'!D322","v":0},{"$f":"'PR-RAS'!E322","v":0},0,0,0,0,0]
[151,317,{"$f":"'PR-RAS'!D323","v":0},{"$f":"'PR-RAS'!E323","v":0},0,0,0,0,0]
[151,318,{"$f":"'PR-RAS'!D324","v":0},{"$f":"'PR-RAS'!E324","v":0},0,0,0,0,0]
[151,319,{"$f":"'PR-RAS'!D325","v":0},{"$f":"'PR-RAS'!E325","v":0},0,0,0,0,0]
[151,320,{"$f":"'PR-RAS'!D326","v":0},{"$f":"'PR-RAS'!E326","v":0},0,0,0,0,0]
[151,321,{"$f":"'PR-RAS'!D327","v":0},{"$f":"'PR-RAS'!E327","v":0},0,0,0,0,0]
[151,322,{"$f":"'PR-RAS'!D328","v":0},{"$f":"'PR-RAS'!E328","v":0},0,0,0,0,0]
[151,323,{"$f":"'PR-RAS'!D329","v":0},{"$f":"'PR-RAS'!E329","v":0},0,0,0,0,0]
[151,324,{"$f":"'PR-RAS'!D330","v":0},{"$f":"'PR-RAS'!E330","v":0},0,0,0,0,0]
[151,325,{"$f":"'PR-RAS'!D331","v":0},{"$f":"'PR-RAS'!E331","v":0},0,0,0,0,0]
[151,326,{"$f":"'PR-RAS'!D332","v":0},{"$f":"'PR-RAS'!E332","v":0},0,0,0,0,0]
[151,327,{"$f":"'PR-RAS'!D333","v":0},{"$f":"'PR-RAS'!E333","v":0},0,0,0,0,0]
[151,328,{"$f":"'PR-RAS'!D334","v":0},{"$f":"'PR-RAS'!E334","v":0},0,0,0,0,0]
[151,329,{"$f":"'PR-RAS'!D335","v":0},{"$f":"'PR-RAS'!E335","v":0},0,0,0,0,0]
[151,330,{"$f":"'PR-RAS'!D336","v":0},{"$f":"'PR-RAS'!E336","v":0},0,0,0,0,0]
[151,331,{"$f":"'PR-RAS'!D337","v":0},{"$f":"'PR-RAS'!E337","v":0},0,0,0,0,0]
[151,332,{"$f":"'PR-RAS'!D338","v":0},{"$f":"'PR-RAS'!E338","v":0},0,0,0,0,0]
[151,333,{"$f":"'PR-RAS'!D339","v":0},{"$f":"'PR-RAS'!E339","v":0},0,0,0,0,0]
[151,334,{"$f":"'PR-RAS'!D340","v":0},{"$f":"'PR-RAS'!E340","v":0},0,0,0,0,0]
[151,335,{"$f":"'PR-RAS'!D341","v":0},{"$f":"'PR-RAS'!E341","v":0},0,0,0,0,0]
[151,336,{"$f":"'PR-RAS'!D342","v":0},{"$f":"'PR-RAS'!E342","v":0},0,0,0,0,0]
[151,337,{"$f":"'PR-RAS'!D343","v":0},{"$f":"'PR-RAS'!E343","v":0},0,0,0,0,0]
[151,338,{"$f":"'PR-RAS'!D344","v":0},{"$f":"'PR-RAS'!E344","v":0},0,0,0,0,0]
[151,339,{"$f":"'PR-RAS'!D345","v":0},{"$f":"'PR-RAS'!E345","v":0},0,0,0,0,0]
[151,340,{"$f":"'PR-RAS'!D346","v":0},{"$f":"'PR-RAS'!E346","v":0},0,0,0,0,0]
[151,341,{"$f":"'PR-RAS'!D347","v":0},{"$f":"'PR-RAS'!E347","v":0},0,0,0,0,0]
[151,342,{"$f":"'PR-RAS'!D348","v":0},{"$f":"'PR-RAS'!E348","v":0},0,0,0,0,0]
[151,343,{"$f":"'PR-RAS'!D349","v":0},{"$f":"'PR-RAS'!E349","v":0},0,0,0,0,0]
[151,344,{"$f":"'PR-RAS'!D350","v":17154.670000000002},{"$f":"'PR-RAS'!E350","v":25779.4},0,0,23637.433679999998,0.72999999999956344,0]
[151,345,{"$f":"'PR-RAS'!D351","v":0},{"$f":"'PR-RAS'!E351","v":0},0,0,0,0,0]
[151,346,{"$f":"'PR-RAS'!D352","v":0},{"$f":"'PR-RAS'!E352","v":0},0,0,0,0,0]
[151,347,{"$f":"'PR-RAS'!D353","v":0},{"$f":"'PR-RAS'!E353","v":0},0,0,0,0,0]
[151,348,{"$f":"'PR-RAS'!D354","v":0},{"$f":"'PR-RAS'!E354","v":0},0,0,0,0,0]
[151,349,{"$f":"'PR-RAS'!D355","v":0},{"$f":"'PR-RAS'!E355","v":0},0,0,0,0,0]
[151,350,{"$f":"'PR-RAS'!D356","v":0},{"$f":"'PR-RAS'!E356","v":0},0,0,0,0,0]
[151,351,{"$f":"'PR-RAS'!D357","v":0},{"$f":"'PR-RAS'!E357","v":0},0,0,0,0,0]
[151,352,{"$f":"'PR-RAS'!D358","v":0},{"$f":"'PR-RAS'!E358","v":0},0,0,0,0,0]
[151,353,{"$f":"'PR-RAS'!D359","v":0},{"$f":"'PR-RAS'!E359","v":0},0,0,0,0,0]
[151,354,{"$f":"'PR-RAS'!D360","v":0},{"$f":"'PR-RAS'!E360","v":0},0,0,0,0,0]
[151,355,{"$f":"'PR-RAS'!D361","v":0},{"$f":"'PR-RAS'!E361","v":0},0,0,0,0,0]
[151,356,{"$f":"'PR-RAS'!D362","v":0},{"$f":"'PR-RAS'!E362","v":0},0,0,0,0,0]
[151,357,{"$f":"'PR-RAS'!D363","v":17154.670000000002},{"$f":"'PR-RAS'!E363","v":25779.4},0,0,24530.708790000001,0.72999999999956344,0]
[151,358,{"$f":"'PR-RAS'!D364","v":0},{"$f":"'PR-RAS'!E364","v":0},0,0,0,0,0]
[151,359,{"$f":"'PR-RAS'!D365","v":0},{"$f":"'PR-RAS'!E365","v":0},0,0,0,0,0]
[151,360,{"$f":"'PR-RAS'!D366","v":0},{"$f":"'PR-RAS'!E366","v":0},0,0,0,0,0]
[151,361,{"$f":"'PR-RAS'!D367","v":0},{"$f":"'PR-RAS'!E367","v":0},0,0,0,0,0]
[151,362,{"$f":"'PR-RAS'!D368","v":0},{"$f":"'PR-RAS'!E368","v":0},0,0,0,0,0]
[151,363,{"$f":"'PR-RAS'!D369","v":888.51},{"$f":"'PR-RAS'!E369","v":797.98},0,0,901.86261000000002,0.50999999999999091,0]
[151,364,{"$f":"'PR-RAS'!D370","v":888.51},{"$f":"'PR-RAS'!E370","v":797.98},0,0,904.34708000000012,0.50999999999999091,0]
[151,365,{"$f":"'PR-RAS'!D371","v":0},{"$f":"'PR-RAS'!E371","v":0},0,0,0,0,0]
[151,366,{"$f":"'PR-RAS'!D372","v":0},{"$f":"'PR-RAS'!E372","v":0},0,0,0,0,0]
[151,367,{"$f":"'PR-RAS'!D373","v":0},{"$f":"'PR-RAS'!E373","v":0},0,0,0,0,0]
[151,368,{"$f":"'PR-RAS'!D374","v":0},{"$f":"'PR-RAS'!E374","v":0},0,0,0,0,0]
[151,369,{"$f":"'PR-RAS'!D375","v":0},{"$f":"'PR-RAS'!E375","v":0},0,0,0,0,0]
[151,370,{"$f":"'PR-RAS'!D376","v":0},{"$f":"'PR-RAS'!E376","v":0},0,0,0,0,0]
[151,371,{"$f":"'PR-RAS'!D377","v":0},{"$f":"'PR-RAS'!E377","v":0},0,0,0,0,0]
[151,372,{"$f":"'PR-RAS'!D378","v":0},{"$f":"'PR-RAS'!E378","v":0},0,0,0,0,0]
[151,373,{"$f":"'PR-RAS'!D379","v":0},{"$f":"'PR-RAS'!E379","v":0},0,0,0,0,0]
[151,374,{"$f":"'PR-RAS'!D380","v":0},{"$f":"'PR-RAS'!E380","v":0},0,0,0,0,0]
[151,375,{"$f":"'PR-RAS'!D381","v":0},{"$f":"'PR-RAS'!E381","v":0},0,0,0,0,0]
[151,376,{"$f":"'PR-RAS'!D382","v":0},{"$f":"'PR-RAS'!E382","v":0},0,0,0,0,0]
[151,377,{"$f":"'PR-RAS'!D383","v":13940.87},{"$f":"'PR-RAS'!E383","v":23994.31},0,0,23347.417730000001,0.44000000000050932,0]
[151,378,{"$f":"'PR-RAS'!D384","v":13940.87},{"$f":"'PR-RAS'!E384","v":23994.31},0,0,23409.347220000003,0.44000000000050932,0]
[151,379,{"$f":"'PR-RAS'!D385","v":0},{"$f":"'PR-RAS'!E385","v":0},0,0,0,0,0]
[151,380,{"$f":"'PR-RAS'!D386","v":0},{"$f":"'PR-RAS'!E386","v":0},0,0,0,0,0]
[151,381,{"$f":"'PR-RAS'!D387","v":0},{"$f":"'PR-RAS'!E387","v":0},0,0,0,0,0]
[151,382,{"$f":"'PR-RAS'!D388","v":0},{"$f":"'PR-RAS'!E388","v":0},0,0,0,0,0]
[151,383,{"$f":"'PR-RAS'!D389","v":0},{"$f":"'PR-RAS'!E389","v":0},0,0,0,0,0]
[151,384,{"$f":"'PR-RAS'!D390","v":0},{"$f":"'PR-RAS'!E390","v":0},0,0,0,0,0]
[151,385,{"$f":"'PR-RAS'!D391","v":2325.29},{"$f":"'PR-RAS'!E391","v":987.11},0,0,1655.3113500000002,0.39999999999997726,0]
[151,386,{"$f":"'PR-RAS'!D392","v":0},{"$f":"'PR-RAS'!E392","v":0},0,0,0,0,0]
[151,387,{"$f":"'PR-RAS'!D393","v":995.42},{"$f":"'PR-RAS'!E393","v":0},0,0,385.22753999999998,0.41999999999995907,0]
[151,388,{"$f":"'PR-RAS'!D394","v":1329.87},{"$f":"'PR-RAS'!E394","v":987.11},0,0,1281.9869200000001,0.24000000000012278,0]
[151,389,{"$f":"'PR-RAS'!D395","v":0},{"$f":"'PR-RAS'!E395","v":0},0,0,0,0,0]
[151,390,{"$f":"'PR-RAS'!D396","v":0},{"$f":"'PR-RAS'!E396","v":0},0,0,0,0,0]
[151,391,{"$f":"'PR-RAS'!D397","v":0},{"$f":"'PR-RAS'!E397","v":0},0,0,0,0,0]
[151,392,{"$f":"'PR-RAS'!D398","v":0},{"$f":"'PR-RAS'!E398","v":0},0,0,0,0,0]
[151,393,{"$f":"'PR-RAS'!D399","v":0},{"$f":"'PR-RAS'!E399","v":0},0,0,0,0,0]
[151,394,{"$f":"'PR-RAS'!D400","v":0},{"$f":"'PR-RAS'!E400","v":0},0,0,0,0,0]
[151,395,{"$f":"'PR-RAS'!D401","v":0},{"$f":"'PR-RAS'!E401","v":0},0,0,0,0,0]
[151,396,{"$f":"'PR-RAS'!D402","v":0},{"$f":"'PR-RAS'!E402","v":0},0,0,0,0,0]
[151,397,{"$f":"'PR-RAS'!D403","v":0},{"$f":"'PR-RAS'!E403","v":0},0,0,0,0,0]
[151,398,{"$f":"'PR-RAS'!D404","v":0},{"$f":"'PR-RAS'!E404","v":0},0,0,0,0,0]
[151,399,{"$f":"'PR-RAS'!D405","v":0},{"$f":"'PR-RAS'!E405","v":0},0,0,0,0,0]
[151,400,{"$f":"'PR-RAS'!D406","v":0},{"$f":"'PR-RAS'!E406","v":0},0,0,0,0,0]
[151,401,{"$f":"'PR-RAS'!D407","v":0},{"$f":"'PR-RAS'!E407","v":0},0,0,0,0,0]
[151,402,{"$f":"'PR-RAS'!D408","v":17154.670000000002},{"$f":"'PR-RAS'!E408","v":25779.4},0,0,27622.814940000004,0.72999999999956344,0]
[151,403,{"$f":"'PR-RAS'!D409","v":0},{"$f":"'PR-RAS'!E409","v":102.36},0,0,82.502160000000003,0.35999999999999943,0]
[151,404,{"$f":"'PR-RAS'!D410","v":0},{"$f":"'PR-RAS'!E410","v":0},0,0,0,0,0]
[151,405,{"$f":"'PR-RAS'!D411","v":0},{"$f":"'PR-RAS'!E411","v":0},0,0,0,0,0]
[151,406,{"$f":"'PR-RAS'!D412","v":95889.13},{"$f":"'PR-RAS'!E412","v":112184.11},0,0,130024.4841,0.24000000000523869,0]
[151,407,{"$f":"'PR-RAS'!D413","v":94377.540000000008},{"$f":"'PR-RAS'!E413","v":113277.48999999999},0,0,130619.53564,0.9499999999825377,0]
[151,408,{"$f":"'PR-RAS'!D414","v":1511.5899999999965},{"$f":"'PR-RAS'!E414","v":0},0,0,616.72871999999859,0.41000000000349246,0]
[151,409,{"$f":"'PR-RAS'!D415","v":0},{"$f":"'PR-RAS'!E415","v":1093.3799999999901},0,0,894.38483999999187,0.3799999999901047,0]
[151,410,{"$f":"'PR-RAS'!D416","v":5118.34},{"$f":"'PR-RAS'!E416","v":6629.9299999999994},0,0,7535.0619999999981,0.41000000000076398,0]
[151,411,{"$f":"'PR-RAS'!D417","v":0},{"$f":"'PR-RAS'!E417","v":0},0,0,0,0,0]
[151,412,{"$f":"'PR-RAS'!D418","v":36.5},{"$f":"'PR-RAS'!E418","v":7.3},0,0,21.0532,0.79999999999999982,0]
[151,413,{"$f":"'PR-RAS'!D420","v":0},{"$f":"'PR-RAS'!E420","v":0},0,0,0,0,0]
[151,414,{"$f":"'PR-RAS'!D421","v":0},{"$f":"'PR-RAS'!E421","v":0},0,0,0,0,0]
[151,415,{"$f":"'PR-RAS'!D422","v":0},{"$f":"'PR-RAS'!E422","v":0},0,0,0,0,0]
[151,416,{"$f":"'PR-RAS'!D423","v":0},{"$f":"'PR-RAS'!E423","v":0},0,0,0,0,0]
[151,417,{"$f":"'PR-RAS'!D424","v":0},{"$f":"'PR-RAS'!E424","v":0},0,0,0,0,0]
[151,418,{"$f":"'PR-RAS'!D425","v":0},{"$f":"'PR-RAS'!E425","v":0},0,0,0,0,0]
[151,419,{"$f":"'PR-RAS'!D426","v":0},{"$f":"'PR-RAS'!E426","v":0},0,0,0,0,0]
[151,420,{"$f":"'PR-RAS'!D427","v":0},{"$f":"'PR-RAS'!E427","v":0},0,0,0,0,0]
[151,421,{"$f":"'PR-RAS'!D428","v":0},{"$f":"'PR-RAS'!E428","v":0},0,0,0,0,0]
[151,422,{"$f":"'PR-RAS'!D429","v":0},{"$f":"'PR-RAS'!E429","v":0},0,0,0,0,0]
[151,423,{"$f":"'PR-RAS'!D430","v":0},{"$f":"'PR-RAS'!E430","v":0},0,0,0,0,0]
[151,424,{"$f":"'PR-RAS'!D431","v":0},{"$f":"'PR-RAS'!E431","v":0},0,0,0,0,0]
[151,425,{"$f":"'PR-RAS'!D432","v":0},{"$f":"'PR-RAS'!E432","v":0},0,0,0,0,0]
[151,426,{"$f":"'PR-RAS'!D433","v":0},{"$f":"'PR-RAS'!E433","v":0},0,0,0,0,0]
[151,427,{"$f":"'PR-RAS'!D434","v":0},{"$f":"'PR-RAS'!E434","v":0},0,0,0,0,0]
[151,428,{"$f":"'PR-RAS'!D435","v":0},{"$f":"'PR-RAS'!E435","v":0},0,0,0,0,0]
[151,429,{"$f":"'PR-RAS'!D436","v":0},{"$f":"'PR-RAS'!E436","v":0},0,0,0,0,0]
[151,430,{"$f":"'PR-RAS'!D437","v":0},{"$f":"'PR-RAS'!E437","v":0},0,0,0,0,0]
[151,431,{"$f":"'PR-RAS'!D438","v":0},{"$f":"'PR-RAS'!E438","v":0},0,0,0,0,0]
[151,432,{"$f":"'PR-RAS'!D439","v":0},{"$f":"'PR-RAS'!E439","v":0},0,0,0,0,0]
[151,433,{"$f":"'PR-RAS'!D440","v":0},{"$f":"'PR-RAS'!E440","v":0},0,0,0,0,0]
[151,434,{"$f":"'PR-RAS'!D441","v":0},{"$f":"'PR-RAS'!E441","v":0},0,0,0,0,0]
[151,435,{"$f":"'PR-RAS'!D442","v":0},{"$f":"'PR-RAS'!E442","v":0},0,0,0,0,0]
[151,436,{"$f":"'PR-RAS'!D443","v":0},{"$f":"'PR-RAS'!E443","v":0},0,0,0,0,0]
[151,437,{"$f":"'PR-RAS'!D444","v":0},{"$f":"'PR-RAS'!E444","v":0},0,0,0,0,0]
[151,438,{"$f":"'PR-RAS'!D445","v":0},{"$f":"'PR-RAS'!E445","v":0},0,0,0,0,0]
[151,439,{"$f":"'PR-RAS'!D446","v":0},{"$f":"'PR-RAS'!E446","v":0},0,0,0,0,0]
[151,440,{"$f":"'PR-RAS'!D447","v":0},{"$f":"'PR-RAS'!E447","v":0},0,0,0,0,0]
[151,441,{"$f":"'PR-RAS'!D448","v":0},{"$f":"'PR-RAS'!E448","v":0},0,0,0,0,0]
[151,442,{"$f":"'PR-RAS'!D449","v":0},{"$f":"'PR-RAS'!E449","v":0},0,0,0,0,0]
[151,443,{"$f":"'PR-RAS'!D450","v":0},{"$f":"'PR-RAS'!E450","v":0},0,0,0,0,0]
[151,444,{"$f":"'PR-RAS'!D451","v":0},{"$f":"'PR-RAS'!E451","v":0},0,0,0,0,0]
[151,445,{"$f":"'PR-RAS'!D452","v":0},{"$f":"'PR-RAS'!E452","v":0},0,0,0,0,0]
[151,446,{"$f":"'PR-RAS'!D453","v":0},{"$f":"'PR-RAS'!E453","v":0},0,0,0,0,0]
[151,447,{"$f":"'PR-RAS'!D454","v":0},{"$f":"'PR-RAS'!E454","v":0},0,0,0,0,0]
[151,448,{"$f":"'PR-RAS'!D455","v":0},{"$f":"'PR-RAS'!E455","v":0},0,0,0,0,0]
[151,449,{"$f":"'PR-RAS'!D456","v":0},{"$f":"'PR-RAS'!E456","v":0},0,0,0,0,0]
[151,450,{"$f":"'PR-RAS'!D457","v":0},{"$f":"'PR-RAS'!E457","v":0},0,0,0,0,0]
[151,451,{"$f":"'PR-RAS'!D458","v":0},{"$f":"'PR-RAS'!E458","v":0},0,0,0,0,0]
[151,452,{"$f":"'PR-RAS'!D459","v":0},{"$f":"'PR-RAS'!E459","v":0},0,0,0,0,0]
[151,453,{"$f":"'PR-RAS'!D460","v":0},{"$f":"'PR-RAS'!E460","v":0},0,0,0,0,0]
[151,454,{"$f":"'PR-RAS'!D461","v":0},{"$f":"'PR-RAS'!E461","v":0},0,0,0,0,0]
[151,455,{"$f":"'PR-RAS'!D462","v":0},{"$f":"'PR-RAS'!E462","v":0},0,0,0,0,0]
[151,456,{"$f":"'PR-RAS'!D463","v":0},{"$f":"'PR-RAS'!E463","v":0},0,0,0,0,0]
[151,457,{"$f":"'PR-RAS'!D464","v":0},{"$f":"'PR-RAS'!E464","v":0},0,0,0,0,0]
[151,458,{"$f":"'PR-RAS'!D465","v":0},{"$f":"'PR-RAS'!E465","v":0},0,0,0,0,0]
[151,459,{"$f":"'PR-RAS'!D466","v":0},{"$f":"'PR-RAS'!E466","v":0},0,0,0,0,0]
[151,460,{"$f":"'PR-RAS'!D467","v":0},{"$f":"'PR-RAS'!E467","v":0},0,0,0,0,0]
[151,461,{"$f":"'PR-RAS'!D468","v":0},{"$f":"'PR-RAS'!E468","v":0},0,0,0,0,0]
[151,462,{"$f":"'PR-RAS'!D469","v":0},{"$f":"'PR-RAS'!E469","v":0},0,0,0,0,0]
[151,463,{"$f":"'PR-RAS'!D470","v":0},{"$f":"'PR-RAS'!E470","v":0},0,0,0,0,0]
[151,464,{"$f":"'PR-RAS'!D471","v":0},{"$f":"'PR-RAS'!E471","v":0},0,0,0,0,0]
[151,465,{"$f":"'PR-RAS'!D472","v":0},{"$f":"'PR-RAS'!E472","v":0},0,0,0,0,0]
[151,466,{"$f":"'PR-RAS'!D473","v":0},{"$f":"'PR-RAS'!E473","v":0},0,0,0,0,0]
[151,467,{"$f":"'PR-RAS'!D474","v":0},{"$f":"'PR-RAS'!E474","v":0},0,0,0,0,0]
[151,468,{"$f":"'PR-RAS'!D475","v":0},{"$f":"'PR-RAS'!E475","v":0},0,0,0,0,0]
[151,469,{"$f":"'PR-RAS'!D476","v":0},{"$f":"'PR-RAS'!E476","v":0},0,0,0,0,0]
[151,470,{"$f":"'PR-RAS'!D477","v":0},{"$f":"'PR-RAS'!E477","v":0},0,0,0,0,0]
[151,471,{"$f":"'PR-RAS'!D478","v":0},{"$f":"'PR-RAS'!E478","v":0},0,0,0,0,0]
[151,472,{"$f":"'PR-RAS'!D479","v":0},{"$f":"'PR-RAS'!E479","v":0},0,0,0,0,0]
[151,473,{"$f":"'PR-RAS'!D480","v":0},{"$f":"'PR-RAS'!E480","v":0},0,0,0,0,0]
[151,474,{"$f":"'PR-RAS'!D481","v":0},{"$f":"'PR-RAS'!E481","v":0},0,0,0,0,0]
[151,475,{"$f":"'PR-RAS'!D482","v":0},{"$f":"'PR-RAS'!E482","v":0},0,0,0,0,0]
[151,476,{"$f":"'PR-RAS'!D483","v":0},{"$f":"'PR-RAS'!E483","v":0},0,0,0,0,0]
[151,477,{"$f":"'PR-RAS'!D484","v":0},{"$f":"'PR-RAS'!E484","v":0},0,0,0,0,0]
[151,478,{"$f":"'PR-RAS'!D485","v":0},{"$f":"'PR-RAS'!E485","v":0},0,0,0,0,0]
[151,479,{"$f":"'PR-RAS'!D486","v":0},{"$f":"'PR-RAS'!E486","v":0},0,0,0,0,0]
[151,480,{"$f":"'PR-RAS'!D487","v":0},{"$f":"'PR-RAS'!E487","v":0},0,0,0,0,0]
[151,481,{"$f":"'PR-RAS'!D488","v":0},{"$f":"'PR-RAS'!E488","v":0},0,0,0,0,0]
[151,482,{"$f":"'PR-RAS'!D489","v":0},{"$f":"'PR-RAS'!E489","v":0},0,0,0,0,0]
[151,483,{"$f":"'PR-RAS'!D490","v":0},{"$f":"'PR-RAS'!E490","v":0},0,0,0,0,0]
[151,484,{"$f":"'PR-RAS'!D491","v":0},{"$f":"'PR-RAS'!E491","v":0},0,0,0,0,0]
[151,485,{"$f":"'PR-RAS'!D492","v":0},{"$f":"'PR-RAS'!E492","v":0},0,0,0,0,0]
[151,486,{"$f":"'PR-RAS'!D493","v":0},{"$f":"'PR-RAS'!E493","v":0},0,0,0,0,0]
[151,487,{"$f":"'PR-RAS'!D494","v":0},{"$f":"'PR-RAS'!E494","v":0},0,0,0,0,0]
[151,488,{"$f":"'PR-RAS'!D495","v":0},{"$f":"'PR-RAS'!E495","v":0},0,0,0,0,0]
[151,489,{"$f":"'PR-RAS'!D496","v":0},{"$f":"'PR-RAS'!E496","v":0},0,0,0,0,0]
[151,490,{"$f":"'PR-RAS'!D497","v":0},{"$f":"'PR-RAS'!E497","v":0},0,0,0,0,0]
[151,491,{"$f":"'PR-RAS'!D498","v":0},{"$f":"'PR-RAS'!E498","v":0},0,0,0,0,0]
[151,492,{"$f":"'PR-RAS'!D499","v":0},{"$f":"'PR-RAS'!E499","v":0},0,0,0,0,0]
[151,493,{"$f":"'PR-RAS'!D500","v":0},{"$f":"'PR-RAS'!E500","v":0},0,0,0,0,0]
[151,494,{"$f":"'PR-RAS'!D501","v":0},{"$f":"'PR-RAS'!E501","v":0},0,0,0,0,0]
[151,495,{"$f":"'PR-RAS'!D502","v":0},{"$f":"'PR-RAS'!E502","v":0},0,0,0,0,0]
[151,496,{"$f":"'PR-RAS'!D503","v":0},{"$f":"'PR-RAS'!E503","v":0},0,0,0,0,0]
[151,497,{"$f":"'PR-RAS'!D504","v":0},{"$f":"'PR-RAS'!E504","v":0},0,0,0,0,0]
[151,498,{"$f":"'PR-RAS'!D505","v":0},{"$f":"'PR-RAS'!E505","v":0},0,0,0,0,0]
[151,499,{"$f":"'PR-RAS'!D506","v":0},{"$f":"'PR-RAS'!E506","v":0},0,0,0,0,0]
[151,500,{"$f":"'PR-RAS'!D507","v":0},{"$f":"'PR-RAS'!E507","v":0},0,0,0,0,0]
[151,501,{"$f":"'PR-RAS'!D508","v":0},{"$f":"'PR-RAS'!E508","v":0},0,0,0,0,0]
[151,502,{"$f":"'PR-RAS'!D509","v":0},{"$f":"'PR-RAS'!E509","v":0},0,0,0,0,0]
[151,503,{"$f":"'PR-RAS'!D510","v":0},{"$f":"'PR-RAS'!E510","v":0},0,0,0,0,0]
[151,504,{"$f":"'PR-RAS'!D511","v":0},{"$f":"'PR-RAS'!E511","v":0},0,0,0,0,0]
[151,505,{"$f":"'PR-RAS'!D512","v":0},{"$f":"'PR-RAS'!E512","v":0},0,0,0,0,0]
[151,506,{"$f":"'PR-RAS'!D513","v":0},{"$f":"'PR-RAS'!E513","v":0},0,0,0,0,0]
[151,507,{"$f":"'PR-RAS'!D514","v":0},{"$f":"'PR-RAS'!E514","v":0},0,0,0,0,0]
[151,508,{"$f":"'PR-RAS'!D515","v":0},{"$f":"'PR-RAS'!E515","v":0},0,0,0,0,0]
[151,509,{"$f":"'PR-RAS'!D516","v":0},{"$f":"'PR-RAS'!E516","v":0},0,0,0,0,0]
[151,510,{"$f":"'PR-RAS'!D517","v":0},{"$f":"'PR-RAS'!E517","v":0},0,0,0,0,0]
[151,511,{"$f":"'PR-RAS'!D518","v":0},{"$f":"'PR-RAS'!E518","v":0},0,0,0,0,0]
[151,512,{"$f":"'PR-RAS'!D519","v":0},{"$f":"'PR-RAS'!E519","v":0},0,0,0,0,0]
[151,513,{"$f":"'PR-RAS'!D520","v":0},{"$f":"'PR-RAS'!E520","v":0},0,0,0,0,0]
[151,514,{"$f":"'PR-RAS'!D521","v":0},{"$f":"'PR-RAS'!E521","v":0},0,0,0,0,0]
[151,515,{"$f":"'PR-RAS'!D522","v":0},{"$f":"'PR-RAS'!E522","v":0},0,0,0,0,0]
[151,516,{"$f":"'PR-RAS'!D523","v":0},{"$f":"'PR-RAS'!E523","v":0},0,0,0,0,0]
[151,517,{"$f":"'PR-RAS'!D524","v":0},{"$f":"'PR-RAS'!E524","v":0},0,0,0,0,0]
[151,518,{"$f":"'PR-RAS'!D525","v":0},{"$f":"'PR-RAS'!E525","v":0},0,0,0,0,0]
[151,519,{"$f":"'PR-RAS'!D526","v":0},{"$f":"'PR-RAS'!E526","v":0},0,0,0,0,0]
[151,520,{"$f":"'PR-RAS'!D527","v":0},{"$f":"'PR-RAS'!E527","v":0},0,0,0,0,0]
[151,521,{"$f":"'PR-RAS'!D528","v":0},{"$f":"'PR-RAS'!E528","v":0},0,0,{"$f":"(B522/1000)*(C522*1+D522*2)","v":0},{"$f":"ABS(C522-ROUND(C522,0))+ABS(D522-ROUND(D522,0))","v":0},0]
[151,522,{"$f":"'PR-RAS'!D529","v":0},{"$f":"'PR-RAS'!E529","v":0},0,0,0,0,0]
[151,523,{"$f":"'PR-RAS'!D530","v":0},{"$f":"'PR-RAS'!E530","v":0},0,0,0,0,0]
[151,524,{"$f":"'PR-RAS'!D531","v":0},{"$f":"'PR-RAS'!E531","v":0},0,0,0,0,0]
[151,525,{"$f":"'PR-RAS'!D532","v":0},{"$f":"'PR-RAS'!E532","v":0},0,0,0,0,0]
[151,526,{"$f":"'PR-RAS'!D533","v":0},{"$f":"'PR-RAS'!E533","v":0},0,0,0,0,0]
[151,527,{"$f":"'PR-RAS'!D534","v":0},{"$f":"'PR-RAS'!E534","v":0},0,0,0,0,0]
[151,528,{"$f":"'PR-RAS'!D535","v":0},{"$f":"'PR-RAS'!E535","v":0},0,0,0,0,0]
[151,529,{"$f":"'PR-RAS'!D536","v":0},{"$f":"'PR-RAS'!E536","v":0},0,0,0,0,0]
[151,530,{"$f":"'PR-RAS'!D537","v":0},{"$f":"'PR-RAS'!E537","v":0},0,0,0,0,0]
[151,531,{"$f":"'PR-RAS'!D538","v":0},{"$f":"'PR-RAS'!E538","v":0},0,0,0,0,0]
[151,532,{"$f":"'PR-RAS'!D539","v":0},{"$f":"'PR-RAS'!E539","v":0},0,0,0,0,0]
[151,533,{"$f":"'PR-RAS'!D540","v":0},{"$f":"'PR-RAS'!E540","v":0},0,0,0,0,0]
[151,534,{"$f":"'PR-RAS'!D541","v":0},{"$f":"'PR-RAS'!E541","v":0},0,0,0,0,0]
[151,535,{"$f":"'PR-RAS'!D542","v":0},{"$f":"'PR-RAS'!E542","v":0},0,0,0,0,0]
[151,536,{"$f":"'PR-RAS'!D543","v":0},{"$f":"'PR-RAS'!E543","v":0},0,0,0,0,0]
[151,537,{"$f":"'PR-RAS'!D544","v":0},{"$f":"'PR-RAS'!E544","v":0},0,0,0,0,0]
[151,538,{"$f":"'PR-RAS'!D545","v":0},{"$f":"'PR-RAS'!E545","v":0},0,0,0,0,0]
[151,539,{"$f":"'PR-RAS'!D546","v":0},{"$f":"'PR-RAS'!E546","v":0},0,0,0,0,0]
[151,540,{"$f":"'PR-RAS'!D547","v":0},{"$f":"'PR-RAS'!E547","v":0},0,0,0,0,0]
[151,541,{"$f":"'PR-RAS'!D548","v":0},{"$f":"'PR-RAS'!E548","v":0},0,0,0,0,0]
[151,542,{"$f":"'PR-RAS'!D549","v":0},{"$f":"'PR-RAS'!E549","v":0},0,0,0,0,0]
[151,543,{"$f":"'PR-RAS'!D550","v":0},{"$f":"'PR-RAS'!E550","v":0},0,0,0,0,0]
[151,544,{"$f":"'PR-RAS'!D551","v":0},{"$f":"'PR-RAS'!E551","v":0},0,0,0,0,0]
[151,545,{"$f":"'PR-RAS'!D552","v":0},{"$f":"'PR-RAS'!E552","v":0},0,0,0,0,0]
[151,546,{"$f":"'PR-RAS'!D553","v":0},{"$f":"'PR-RAS'!E553","v":0},0,0,0,0,0]
[151,547,{"$f":"'PR-RAS'!D554","v":0},{"$f":"'PR-RAS'!E554","v":0},0,0,0,0,0]
[151,548,{"$f":"'PR-RAS'!D555","v":0},{"$f":"'PR-RAS'!E555","v":0},0,0,0,0,0]
[151,549,{"$f":"'PR-RAS'!D556","v":0},{"$f":"'PR-RAS'!E556","v":0},0,0,0,0,0]
[151,550,{"$f":"'PR-RAS'!D557","v":0},{"$f":"'PR-RAS'!E557","v":0},0,0,0,0,0]
[151,551,{"$f":"'PR-RAS'!D558","v":0},{"$f":"'PR-RAS'!E558","v":0},0,0,0,0,0]
[151,552,{"$f":"'PR-RAS'!D559","v":0},{"$f":"'PR-RAS'!E559","v":0},0,0,0,0,0]
[151,553,{"$f":"'PR-RAS'!D560","v":0},{"$f":"'PR-RAS'!E560","v":0},0,0,0,0,0]
[151,554,{"$f":"'PR-RAS'!D561","v":0},{"$f":"'PR-RAS'!E561","v":0},0,0,0,0,0]
[151,555,{"$f":"'PR-RAS'!D562","v":0},{"$f":"'PR-RAS'!E562","v":0},0,0,0,0,0]
[151,556,{"$f":"'PR-RAS'!D563","v":0},{"$f":"'PR-RAS'!E563","v":0},0,0,0,0,0]
[151,557,{"$f":"'PR-RAS'!D564","v":0},{"$f":"'PR-RAS'!E564","v":0},0,0,0,0,0]
[151,558,{"$f":"'PR-RAS'!D565","v":0},{"$f":"'PR-RAS'!E565","v":0},0,0,0,0,0]
[151,559,{"$f":"'PR-RAS'!D566","v":0},{"$f":"'PR-RAS'!E566","v":0},0,0,0,0,0]
[151,560,{"$f":"'PR-RAS'!D567","v":0},{"$f":"'PR-RAS'!E567","v":0},0,0,0,0,0]
[151,561,{"$f":"'PR-RAS'!D568","v":0},{"$f":"'PR-RAS'!E568","v":0},0,0,0,0,0]
[151,562,{"$f":"'PR-RAS'!D569","v":0},{"$f":"'PR-RAS'!E569","v":0},0,0,0,0,0]
[151,563,{"$f":"'PR-RAS'!D570","v":0},{"$f":"'PR-RAS'!E570","v":0},0,0,0,0,0]
[151,564,{"$f":"'PR-RAS'!D571","v":0},{"$f":"'PR-RAS'!E571","v":0},0,0,0,0,0]
[151,565,{"$f":"'PR-RAS'!D572","v":0},{"$f":"'PR-RAS'!E572","v":0},0,0,0,0,0]
[151,566,{"$f":"'PR-RAS'!D573","v":0},{"$f":"'PR-RAS'!E573","v":0},0,0,0,0,0]
[151,567,{"$f":"'PR-RAS'!D574","v":0},{"$f":"'PR-RAS'!E574","v":0},0,0,0,0,0]
[151,568,{"$f":"'PR-RAS'!D575","v":0},{"$f":"'PR-RAS'!E575","v":0},0,0,0,0,0]
[151,569,{"$f":"'PR-RAS'!D576","v":0},{"$f":"'PR-RAS'!E576","v":0},0,0,0,0,0]
[151,570,{"$f":"'PR-RAS'!D577","v":0},{"$f":"'PR-RAS'!E577","v":0},0,0,0,0,0]
[151,571,{"$f":"'PR-RAS'!D578","v":0},{"$f":"'PR-RAS'!E578","v":0},0,0,0,0,0]
[151,572,{"$f":"'PR-RAS'!D579","v":0},{"$f":"'PR-RAS'!E579","v":0},0,0,0,0,0]
[151,573,{"$f":"'PR-RAS'!D580","v":0},{"$f":"'PR-RAS'!E580","v":0},0,0,0,0,0]
[151,574,{"$f":"'PR-RAS'!D581","v":0},{"$f":"'PR-RAS'!E581","v":0},0,0,0,0,0]
[151,575,{"$f":"'PR-RAS'!D582","v":0},{"$f":"'PR-RAS'!E582","v":0},0,0,0,0,0]
[151,576,{"$f":"'PR-RAS'!D583","v":0},{"$f":"'PR-RAS'!E583","v":0},0,0,0,0,0]
[151,577,{"$f":"'PR-RAS'!D584","v":0},{"$f":"'PR-RAS'!E584","v":0},0,0,0,0,0]
[151,578,{"$f":"'PR-RAS'!D585","v":0},{"$f":"'PR-RAS'!E585","v":0},0,0,0,0,0]
[151,579,{"$f":"'PR-RAS'!D586","v":0},{"$f":"'PR-RAS'!E586","v":0},0,0,0,0,0]
[151,580,{"$f":"'PR-RAS'!D587","v":0},{"$f":"'PR-RAS'!E587","v":0},0,0,0,0,0]
[151,581,{"$f":"'PR-RAS'!D588","v":0},{"$f":"'PR-RAS'!E588","v":0},0,0,0,0,0]
[151,582,{"$f":"'PR-RAS'!D589","v":0},{"$f":"'PR-RAS'!E589","v":0},0,0,0,0,0]
[151,583,{"$f":"'PR-RAS'!D590","v":0},{"$f":"'PR-RAS'!E590","v":0},0,0,0,0,0]
[151,584,{"$f":"'PR-RAS'!D591","v":0},{"$f":"'PR-RAS'!E591","v":0},0,0,0,0,0]
[151,585,{"$f":"'PR-RAS'!D592","v":0},{"$f":"'PR-RAS'!E592","v":0},0,0,0,0,0]
[151,586,{"$f":"'PR-RAS'!D593","v":0},{"$f":"'PR-RAS'!E593","v":0},0,0,0,0,0]
[151,587,{"$f":"'PR-RAS'!D594","v":0},{"$f":"'PR-RAS'!E594","v":0},0,0,0,0,0]
[151,588,{"$f":"'PR-RAS'!D595","v":0},{"$f":"'PR-RAS'!E595","v":0},0,0,0,0,0]
[151,589,{"$f":"'PR-RAS'!D596","v":0},{"$f":"'PR-RAS'!E596","v":0},0,0,0,0,0]
[151,590,{"$f":"'PR-RAS'!D597","v":0},{"$f":"'PR-RAS'!E597","v":0},0,0,0,0,0]
[151,591,{"$f":"'PR-RAS'!D598","v":0},{"$f":"'PR-RAS'!E598","v":0},0,0,0,0,0]
[151,592,{"$f":"'PR-RAS'!D599","v":0},{"$f":"'PR-RAS'!E599","v":0},0,0,0,0,0]
[151,593,{"$f":"'PR-RAS'!D600","v":0},{"$f":"'PR-RAS'!E600","v":0},0,0,0,0,0]
[151,594,{"$f":"'PR-RAS'!D601","v":0},{"$f":"'PR-RAS'!E601","v":0},0,0,0,0,0]
[151,595,{"$f":"'PR-RAS'!D602","v":0},{"$f":"'PR-RAS'!E602","v":0},0,0,0,0,0]
[151,596,{"$f":"'PR-RAS'!D603","v":0},{"$f":"'PR-RAS'!E603","v":0},0,0,0,0,0]
[151,597,{"$f":"'PR-RAS'!D604","v":0},{"$f":"'PR-RAS'!E604","v":0},0,0,0,0,0]
[151,598,{"$f":"'PR-RAS'!D605","v":0},{"$f":"'PR-RAS'!E605","v":0},0,0,0,0,0]
[151,599,{"$f":"'PR-RAS'!D606","v":0},{"$f":"'PR-RAS'!E606","v":0},0,0,0,0,0]
[151,600,{"$f":"'PR-RAS'!D607","v":0},{"$f":"'PR-RAS'!E607","v":0},0,0,0,0,0]
[151,601,{"$f":"'PR-RAS'!D608","v":0},{"$f":"'PR-RAS'!E608","v":0},0,0,0,0,0]
[151,602,{"$f":"'PR-RAS'!D609","v":0},{"$f":"'PR-RAS'!E609","v":0},0,0,0,0,0]
[151,603,{"$f":"'PR-RAS'!D610","v":0},{"$f":"'PR-RAS'!E610","v":0},0,0,0,0,0]
[151,604,{"$f":"'PR-RAS'!D611","v":0},{"$f":"'PR-RAS'!E611","v":0},0,0,0,0,0]
[151,605,{"$f":"'PR-RAS'!D612","v":0},{"$f":"'PR-RAS'!E612","v":0},0,0,0,0,0]
[151,606,{"$f":"'PR-RAS'!D613","v":0},{"$f":"'PR-RAS'!E613","v":0},0,0,0,0,0]
[151,607,{"$f":"'PR-RAS'!D614","v":0},{"$f":"'PR-RAS'!E614","v":0},0,0,0,0,0]
[151,608,{"$f":"'PR-RAS'!D615","v":0},{"$f":"'PR-RAS'!E615","v":0},0,0,0,0,0]
[151,609,{"$f":"'PR-RAS'!D616","v":0},{"$f":"'PR-RAS'!E616","v":0},0,0,0,0,0]
[151,610,{"$f":"'PR-RAS'!D617","v":0},{"$f":"'PR-RAS'!E617","v":0},0,0,0,0,0]
[151,611,{"$f":"'PR-RAS'!D618","v":0},{"$f":"'PR-RAS'!E618","v":0},0,0,0,0,0]
[151,612,{"$f":"'PR-RAS'!D619","v":0},{"$f":"'PR-RAS'!E619","v":0},0,0,0,0,0]
[151,613,{"$f":"'PR-RAS'!D620","v":0},{"$f":"'PR-RAS'!E620","v":0},0,0,0,0,0]
[151,614,{"$f":"'PR-RAS'!D621","v":0},{"$f":"'PR-RAS'!E621","v":0},0,0,0,0,0]
[151,615,{"$f":"'PR-RAS'!D622","v":0},{"$f":"'PR-RAS'!E622","v":0},0,0,0,0,0]
[151,616,{"$f":"'PR-RAS'!D623","v":0},{"$f":"'PR-RAS'!E623","v":0},0,0,0,0,0]
[151,617,{"$f":"'PR-RAS'!D624","v":0},{"$f":"'PR-RAS'!E624","v":0},0,0,0,0,0]
[151,618,{"$f":"'PR-RAS'!D625","v":0},{"$f":"'PR-RAS'!E625","v":0},0,0,0,0,0]
[151,619,{"$f":"'PR-RAS'!D626","v":0},{"$f":"'PR-RAS'!E626","v":0},0,0,0,0,0]
[151,620,{"$f":"'PR-RAS'!D627","v":0},{"$f":"'PR-RAS'!E627","v":0},0,0,0,0,0]
[151,621,{"$f":"'PR-RAS'!D628","v":0},{"$f":"'PR-RAS'!E628","v":0},0,0,0,0,0]
[151,622,{"$f":"'PR-RAS'!D629","v":0},{"$f":"'PR-RAS'!E629","v":0},0,0,0,0,0]
[151,623,{"$f":"'PR-RAS'!D630","v":0},{"$f":"'PR-RAS'!E630","v":0},0,0,0,0,0]
[151,624,{"$f":"'PR-RAS'!D631","v":0},{"$f":"'PR-RAS'!E631","v":0},0,0,0,0,0]
[151,625,{"$f":"'PR-RAS'!D632","v":0},{"$f":"'PR-RAS'!E632","v":0},0,0,0,0,0]
[151,626,{"$f":"'PR-RAS'!D633","v":0},{"$f":"'PR-RAS'!E633","v":0},0,0,0,0,0]
[151,627,{"$f":"'PR-RAS'!D634","v":0},{"$f":"'PR-RAS'!E634","v":0},0,0,0,0,0]
[151,628,{"$f":"'PR-RAS'!D635","v":0},{"$f":"'PR-RAS'!E635","v":0},0,0,0,0,0]
[151,629,{"$f":"'PR-RAS'!D636","v":0},{"$f":"'PR-RAS'!E636","v":0},0,0,0,0,0]
[151,630,{"$f":"'PR-RAS'!D637","v":0},{"$f":"'PR-RAS'!E637","v":0},0,0,0,0,0]
[151,631,{"$f":"'PR-RAS'!D638","v":0},{"$f":"'PR-RAS'!E638","v":0},0,0,0,0,0]
[151,632,{"$f":"'PR-RAS'!D639","v":95889.13},{"$f":"'PR-RAS'!E639","v":112184.11},0,0,202402.6452,0.24000000000523869,0]
[151,633,{"$f":"'PR-RAS'!D640","v":94377.540000000008},{"$f":"'PR-RAS'!E640","v":113277.48999999999},0,0,203150.28516000003,0.9499999999825377,0]
[151,634,{"$f":"'PR-RAS'!D641","v":1511.5899999999965},{"$f":"'PR-RAS'!E641","v":0},0,0,958.34805999999776,0.41000000000349246,0]
[151,635,{"$f":"'PR-RAS'!D642","v":0},{"$f":"'PR-RAS'!E642","v":1093.3799999999901},0,0,1388.5925999999874,0.3799999999901047,0]
[151,636,{"$f":"'PR-RAS'!D643","v":5118.34},{"$f":"'PR-RAS'!E643","v":6629.9299999999994},0,0,11688.535199999998,0.41000000000076398,0]
[151,637,{"$f":"'PR-RAS'!D644","v":0},{"$f":"'PR-RAS'!E644","v":0},0,0,0,0,0]
[151,638,{"$f":"'PR-RAS'!D645","v":6629.9299999999967},{"$f":"'PR-RAS'!E645","v":5536.5500000000093},0,0,11294.533140000009,0.51999999999407009,0]
[151,639,{"$f":"'PR-RAS'!D646","v":0},{"$f":"'PR-RAS'!E646","v":0},0,0,0,0,0]
[151,640,{"$f":"'PR-RAS'!D647","v":0},{"$f":"'PR-RAS'!E647","v":0},0,0,0,0,0]
[151,641,{"$f":"'PR-RAS'!D649","v":0},{"$f":"'PR-RAS'!E649","v":0},0,0,0,0,0]
[151,642,{"$f":"'PR-RAS'!D650","v":0},{"$f":"'PR-RAS'!E650","v":0},0,0,0,0,0]
[151,643,{"$f":"'PR-RAS'!D651","v":0},{"$f":"'PR-RAS'!E651","v":0},0,0,0,0,0]
[151,644,{"$f":"'PR-RAS'!D652","v":0},{"$f":"'PR-RAS'!E652","v":0},0,0,0,0,0]
[151,645,{"$f":"'PR-RAS'!D653","v":0},{"$f":"'PR-RAS'!E653","v":0},0,0,0,0,0]
[151,646,{"$f":"'PR-RAS'!D654","v":3},{"$f":"'PR-RAS'!E654","v":3},0,0,5.8140000000000001,0,0]
[151,647,{"$f":"'PR-RAS'!D655","v":0},{"$f":"'PR-RAS'!E655","v":0},0,0,0,0,0]
[151,648,{"$f":"'PR-RAS'!D656","v":3},{"$f":"'PR-RAS'!E656","v":3},0,0,5.8319999999999999,0,0]
[151,649,{"$f":"'PR-RAS'!D657","v":0},{"$f":"'PR-RAS'!E657","v":0},0,0,0,0,0]
[151,650,{"$f":"'PR-RAS'!D658","v":0},{"$f":"'PR-RAS'!E658","v":0},0,0,0,0,0]
[151,651,{"$f":"'PR-RAS'!D659","v":0},{"$f":"'PR-RAS'!E659","v":0},0,0,0,0,0]
[151,652,{"$f":"'PR-RAS'!D660","v":0},{"$f":"'PR-RAS'!E660","v":0},0,0,0,0,0]
[151,653,{"$f":"'PR-RAS'!D661","v":0},{"$f":"'PR-RAS'!E661","v":0},0,0,0,0,0]
[151,654,{"$f":"'PR-RAS'!D662","v":0},{"$f":"'PR-RAS'!E662","v":0},0,0,0,0,0]
[151,655,{"$f":"'PR-RAS'!D663","v":0},{"$f":"'PR-RAS'!E663","v":0},0,0,0,0,0]
[151,656,{"$f":"'PR-RAS'!D664","v":0},{"$f":"'PR-RAS'!E664","v":0},0,0,0,0,0]
[151,657,{"$f":"'PR-RAS'!D665","v":0},{"$f":"'PR-RAS'!E665","v":0},0,0,0,0,0]
[151,658,{"$f":"'PR-RAS'!D666","v":0},{"$f":"'PR-RAS'!E666","v":0},0,0,0,0,0]
[151,659,{"$f":"'PR-RAS'!D667","v":0},{"$f":"'PR-RAS'!E667","v":0},0,0,0,0,0]
[151,660,{"$f":"'PR-RAS'!D668","v":0},{"$f":"'PR-RAS'!E668","v":0},0,0,0,0,0]
[151,661,{"$f":"'PR-RAS'!D669","v":0},{"$f":"'PR-RAS'!E669","v":0},0,0,0,0,0]
[151,662,{"$f":"'PR-RAS'!D670","v":0},{"$f":"'PR-RAS'!E670","v":0},0,0,0,0,0]
[151,663,{"$f":"'PR-RAS'!D671","v":0},{"$f":"'PR-RAS'!E671","v":0},0,0,0,0,0]
[151,664,{"$f":"'PR-RAS'!D672","v":0},{"$f":"'PR-RAS'!E672","v":0},0,0,0,0,0]
[151,665,{"$f":"'PR-RAS'!D673","v":0},{"$f":"'PR-RAS'!E673","v":0},0,0,0,0,0]
[151,666,{"$f":"'PR-RAS'!D674","v":0},{"$f":"'PR-RAS'!E674","v":0},0,0,0,0,0]
[151,667,{"$f":"'PR-RAS'!D675","v":0},{"$f":"'PR-RAS'!E675","v":0},0,0,0,0,0]
[151,668,{"$f":"'PR-RAS'!D676","v":0},{"$f":"'PR-RAS'!E676","v":0},0,0,0,0,0]
[151,669,{"$f":"'PR-RAS'!D677","v":4645.3},{"$f":"'PR-RAS'!E677","v":8145.3},0,0,14006.117100000001,0.6000000000003638,0]
[151,670,{"$f":"'PR-RAS'!D678","v":663.61},{"$f":"'PR-RAS'!E678","v":0},0,0,444.61870000000005,0.38999999999998636,0]
[151,671,{"$f":"'PR-RAS'!D679","v":0},{"$f":"'PR-RAS'!E679","v":0},0,0,{"$f":"(B672/1000)*(C672*1+D672*2)","v":0},{"$f":"ABS(C672-ROUND(C672,0))+ABS(D672-ROUND(D672,0))","v":0},0]
[151,672,{"$f":"'PR-RAS'!D680","v":0},{"$f":"'PR-RAS'!E680","v":0},0,0,0,0,0]
[151,673,{"$f":"'PR-RAS'!D681","v":0},{"$f":"'PR-RAS'!E681","v":0},0,0,0,0,0]
[151,674,{"$f":"'PR-RAS'!D682","v":0},{"$f":"'PR-RAS'!E682","v":0},0,0,0,0,0]
[151,675,{"$f":"'PR-RAS'!D683","v":0},{"$f":"'PR-RAS'!E683","v":0},0,0,0,0,0]
[151,676,{"$f":"'PR-RAS'!D684","v":0},{"$f":"'PR-RAS'!E684","v":0},0,0,0,0,0]
[151,677,{"$f":"'PR-RAS'!D685","v":0},{"$f":"'PR-RAS'!E685","v":0},0,0,0,0,0]
[151,678,{"$f":"'PR-RAS'!D686","v":0},{"$f":"'PR-RAS'!E686","v":0},0,0,0,0,0]
[151,679,{"$f":"'PR-RAS'!D687","v":0},{"$f":"'PR-RAS'!E687","v":0},0,0,0,0,0]
[151,680,{"$f":"'PR-RAS'!D688","v":0},{"$f":"'PR-RAS'!E688","v":0},0,0,0,0,0]
[151,681,{"$f":"'PR-RAS'!D689","v":0},{"$f":"'PR-RAS'!E689","v":0},0,0,0,0,0]
[151,682,{"$f":"'PR-RAS'!D690","v":0},{"$f":"'PR-RAS'!E690","v":0},0,0,0,0,0]
[151,683,{"$f":"'PR-RAS'!D691","v":0},{"$f":"'PR-RAS'!E691","v":0},0,0,0,0,0]
[151,684,{"$f":"'PR-RAS'!D692","v":0},{"$f":"'PR-RAS'!E692","v":0},0,0,0,0,0]
[151,685,{"$f":"'PR-RAS'!D693","v":0},{"$f":"'PR-RAS'!E693","v":0},0,0,0,0,0]
[151,686,{"$f":"'PR-RAS'!D694","v":0},{"$f":"'PR-RAS'!E694","v":0},0,0,0,0,0]
[151,687,{"$f":"'PR-RAS'!D695","v":0},{"$f":"'PR-RAS'!E695","v":0},0,0,0,0,0]
[151,688,{"$f":"'PR-RAS'!D696","v":0},{"$f":"'PR-RAS'!E696","v":0},0,0,0,0,0]
[151,689,{"$f":"'PR-RAS'!D697","v":0},{"$f":"'PR-RAS'!E697","v":0},0,0,0,0,0]
[151,690,{"$f":"'PR-RAS'!D698","v":0},{"$f":"'PR-RAS'!E698","v":0},0,0,0,0,0]
[151,691,{"$f":"'PR-RAS'!D699","v":0},{"$f":"'PR-RAS'!E699","v":0},0,0,0,0,0]
[151,692,{"$f":"'PR-RAS'!D700","v":0},{"$f":"'PR-RAS'!E700","v":0},0,0,0,0,0]
[151,693,{"$f":"'PR-RAS'!D701","v":0},{"$f":"'PR-RAS'!E701","v":0},0,0,0,0,0]
[151,694,{"$f":"'PR-RAS'!D702","v":0},{"$f":"'PR-RAS'!E702","v":0},0,0,0,0,0]
[151,695,{"$f":"'PR-RAS'!D703","v":0},{"$f":"'PR-RAS'!E703","v":0},0,0,0,0,0]
[151,696,{"$f":"'PR-RAS'!D704","v":0},{"$f":"'PR-RAS'!E704","v":0},0,0,0,0,0]
[151,697,{"$f":"'PR-RAS'!D705","v":0},{"$f":"'PR-RAS'!E705","v":0},0,0,0,0,0]
[151,698,{"$f":"'PR-RAS'!D706","v":0},{"$f":"'PR-RAS'!E706","v":0},0,0,0,0,0]
[151,699,{"$f":"'PR-RAS'!D707","v":0},{"$f":"'PR-RAS'!E707","v":0},0,0,0,0,0]
[151,700,{"$f":"'PR-RAS'!D708","v":0},{"$f":"'PR-RAS'!E708","v":0},0,0,0,0,0]
[151,701,{"$f":"'PR-RAS'!D709","v":0},{"$f":"'PR-RAS'!E709","v":0},0,0,0,0,0]
[151,702,{"$f":"'PR-RAS'!D710","v":1101.1300000000001},{"$f":"'PR-RAS'!E710","v":1060.07},0,0,2261.3315399999997,0.20000000000004547,0]
[151,703,{"$f":"'PR-RAS'!D711","v":0},{"$f":"'PR-RAS'!E711","v":0},0,0,0,0,0]
[151,704,{"$f":"'PR-RAS'!D712","v":0},{"$f":"'PR-RAS'!E712","v":0},0,0,0,0,0]
[151,705,{"$f":"'PR-RAS'!D713","v":0},{"$f":"'PR-RAS'!E713","v":0},0,0,{"$f":"(B706/1000)*(C706*1+D706*2)","v":0},{"$f":"ABS(C706-ROUND(C706,0))+ABS(D706-ROUND(D706,0))","v":0},0]
[151,706,{"$f":"'PR-RAS'!D714","v":0},{"$f":"'PR-RAS'!E714","v":0},0,0,0,0,0]
[151,707,{"$f":"'PR-RAS'!D715","v":0},{"$f":"'PR-RAS'!E715","v":0},0,0,0,0,0]
[151,708,{"$f":"'PR-RAS'!D716","v":0},{"$f":"'PR-RAS'!E716","v":0},0,0,0,0,0]
[151,709,{"$f":"'PR-RAS'!D717","v":476.93},{"$f":"'PR-RAS'!E717","v":0},0,0,338.14337,6.9999999999993179E-2,0]
[151,710,{"$f":"'PR-RAS'!D718","v":1639.13},{"$f":"'PR-RAS'!E718","v":1815.6},0,0,3741.9342999999999,0.53000000000020009,0]
[151,711,{"$f":"'PR-RAS'!D719","v":0},{"$f":"'PR-RAS'!E719","v":0},0,0,0,0,0]
[151,712,{"$f":"'PR-RAS'!D720","v":0},{"$f":"'PR-RAS'!E720","v":0},0,0,0,0,0]
[151,713,{"$f":"'PR-RAS'!D721","v":2798.23},{"$f":"'PR-RAS'!E721","v":2437.37},0,0,5470.8276099999994,0.59999999999990905,0]
[151,714,{"$f":"'PR-RAS'!D722","v":340.84},{"$f":"'PR-RAS'!E722","v":4519.62},0,0,6697.3771199999992,0.54000000000013415,0]
[151,715,{"$f":"'PR-RAS'!D723","v":0},{"$f":"'PR-RAS'!E723","v":0},0,0,0,0,0]
[151,716,{"$f":"'PR-RAS'!D724","v":0},{"$f":"'PR-RAS'!E724","v":0},0,0,0,0,0]
[151,717,{"$f":"'PR-RAS'!D725","v":0},{"$f":"'PR-RAS'!E725","v":0},0,0,0,0,0]
[151,718,{"$f":"'PR-RAS'!D726","v":692.43},{"$f":"'PR-RAS'!E726","v":814.44},0,0,1666.7005799999999,0.87000000000000455,0]
[151,719,{"$f":"'PR-RAS'!D727","v":0},{"$f":"'PR-RAS'!E727","v":0},0,0,0,0,0]
[151,720,{"$f":"'PR-RAS'!D728","v":0},{"$f":"'PR-RAS'!E728","v":0},0,0,0,0,0]
[151,721,{"$f":"'PR-RAS'!D729","v":0},{"$f":"'PR-RAS'!E729","v":0},0,0,0,0,0]
[151,722,{"$f":"'PR-RAS'!D730","v":0},{"$f":"'PR-RAS'!E730","v":0},0,0,0,0,0]
[151,723,{"$f":"'PR-RAS'!D731","v":0},{"$f":"'PR-RAS'!E731","v":0},0,0,0,0,0]
[151,724,{"$f":"'PR-RAS'!D732","v":0},{"$f":"'PR-RAS'!E732","v":0},0,0,0,0,0]
[151,725,{"$f":"'PR-RAS'!D733","v":0},{"$f":"'PR-RAS'!E733","v":0},0,0,0,0,0]
[151,726,{"$f":"'PR-RAS'!D734","v":0},{"$f":"'PR-RAS'!E734","v":0},0,0,0,0,0]
[151,727,{"$f":"'PR-RAS'!D735","v":0},{"$f":"'PR-RAS'!E735","v":0},0,0,0,0,0]
[151,728,{"$f":"'PR-RAS'!D736","v":0},{"$f":"'PR-RAS'!E736","v":0},0,0,0,0,0]
[151,729,{"$f":"'PR-RAS'!D737","v":0},{"$f":"'PR-RAS'!E737","v":0},0,0,0,0,0]
[151,730,{"$f":"'PR-RAS'!D738","v":0},{"$f":"'PR-RAS'!E738","v":0},0,0,0,0,0]
[151,731,{"$f":"'PR-RAS'!D739","v":0},{"$f":"'PR-RAS'!E739","v":0},0,0,0,0,0]
[151,732,{"$f":"'PR-RAS'!D740","v":0},{"$f":"'PR-RAS'!E740","v":0},0,0,0,0,0]
[151,733,{"$f":"'PR-RAS'!D741","v":0},{"$f":"'PR-RAS'!E741","v":0},0,0,0,0,0]
[151,734,{"$f":"'PR-RAS'!D742","v":0},{"$f":"'PR-RAS'!E742","v":0},0,0,0,0,0]
[151,735,{"$f":"'PR-RAS'!D743","v":0},{"$f":"'PR-RAS'!E743","v":0},0,0,0,0,0]
[151,736,{"$f":"'PR-RAS'!D744","v":0},{"$f":"'PR-RAS'!E744","v":0},0,0,0,0,0]
[151,737,{"$f":"'PR-RAS'!D745","v":0},{"$f":"'PR-RAS'!E745","v":0},0,0,0,0,0]
[151,738,{"$f":"'PR-RAS'!D746","v":0},{"$f":"'PR-RAS'!E746","v":0},0,0,0,0,0]
[151,739,{"$f":"'PR-RAS'!D747","v":0},{"$f":"'PR-RAS'!E747","v":0},0,0,0,0,0]
[151,740,{"$f":"'PR-RAS'!D748","v":0},{"$f":"'PR-RAS'!E748","v":0},0,0,0,0,0]
[151,741,{"$f":"'PR-RAS'!D749","v":0},{"$f":"'PR-RAS'!E749","v":0},0,0,0,0,0]
[151,742,{"$f":"'PR-RAS'!D750","v":0},{"$f":"'PR-RAS'!E750","v":0},0,0,0,0,0]
[151,743,{"$f":"'PR-RAS'!D751","v":0},{"$f":"'PR-RAS'!E751","v":0},0,0,0,0,0]
[151,744,{"$f":"'PR-RAS'!D752","v":0},{"$f":"'PR-RAS'!E752","v":0},0,0,0,0,0]
[151,745,{"$f":"'PR-RAS'!D753","v":0},{"$f":"'PR-RAS'!E753","v":0},0,0,0,0,0]
[151,746,{"$f":"'PR-RAS'!D754","v":0},{"$f":"'PR-RAS'!E754","v":0},0,0,0,0,0]
[151,747,{"$f":"'PR-RAS'!D755","v":0},{"$f":"'PR-RAS'!E755","v":0},0,0,0,0,0]
[151,748,{"$f":"'PR-RAS'!D756","v":0},{"$f":"'PR-RAS'!E756","v":0},0,0,0,0,0]
[151,749,{"$f":"'PR-RAS'!D757","v":0},{"$f":"'PR-RAS'!E757","v":0},0,0,0,0,0]
[151,750,{"$f":"'PR-RAS'!D758","v":0},{"$f":"'PR-RAS'!E758","v":0},0,0,0,0,0]
[151,751,{"$f":"'PR-RAS'!D759","v":0},{"$f":"'PR-RAS'!E759","v":0},0,0,0,0,0]
[151,752,{"$f":"'PR-RAS'!D760","v":0},{"$f":"'PR-RAS'!E760","v":0},0,0,0,0,0]
[151,753,{"$f":"'PR-RAS'!D761","v":0},{"$f":"'PR-RAS'!E761","v":0},0,0,0,0,0]
[151,754,{"$f":"'PR-RAS'!D762","v":0},{"$f":"'PR-RAS'!E762","v":0},0,0,0,0,0]
[151,755,{"$f":"'PR-RAS'!D763","v":0},{"$f":"'PR-RAS'!E763","v":0},0,0,0,0,0]
[151,756,{"$f":"'PR-RAS'!D764","v":0},{"$f":"'PR-RAS'!E764","v":0},0,0,0,0,0]
[151,757,{"$f":"'PR-RAS'!D765","v":0},{"$f":"'PR-RAS'!E765","v":0},0,0,0,0,0]
[151,758,{"$f":"'PR-RAS'!D766","v":0},{"$f":"'PR-RAS'!E766","v":0},0,0,0,0,0]
[151,759,{"$f":"'PR-RAS'!D767","v":0},{"$f":"'PR-RAS'!E767","v":0},0,0,0,0,0]
[151,760,{"$f":"'PR-RAS'!D768","v":0},{"$f":"'PR-RAS'!E768","v":0},0,0,0,0,0]
[151,761,{"$f":"'PR-RAS'!D769","v":0},{"$f":"'PR-RAS'!E769","v":0},0,0,0,0,0]
[151,762,{"$f":"'PR-RAS'!D770","v":0},{"$f":"'PR-RAS'!E770","v":0},0,0,0,0,0]
[151,763,{"$f":"'PR-RAS'!D771","v":0},{"$f":"'PR-RAS'!E771","v":0},0,0,0,0,0]
[151,764,{"$f":"'PR-RAS'!D772","v":0},{"$f":"'PR-RAS'!E772","v":0},0,0,0,0,0]
[151,765,{"$f":"'PR-RAS'!D773","v":0},{"$f":"'PR-RAS'!E773","v":0},0,0,0,0,0]
[151,766,{"$f":"'PR-RAS'!D774","v":0},{"$f":"'PR-RAS'!E774","v":0},0,0,0,0,0]
[151,767,{"$f":"'PR-RAS'!D775","v":0},{"$f":"'PR-RAS'!E775","v":0},0,0,{"$f":"(B768/1000)*(C768*1+D768*2)","v":0},{"$f":"ABS(C768-ROUND(C768,0))+ABS(D768-ROUND(D768,0))","v":0},0]
[151,768,{"$f":"'PR-RAS'!D776","v":0},{"$f":"'PR-RAS'!E776","v":0},0,0,0,0,0]
[151,769,{"$f":"'PR-RAS'!D777","v":0},{"$f":"'PR-RAS'!E777","v":0},0,0,0,0,0]
[151,770,{"$f":"'PR-RAS'!D778","v":0},{"$f":"'PR-RAS'!E778","v":0},0,0,0,0,0]
[151,771,{"$f":"'PR-RAS'!D779","v":0},{"$f":"'PR-RAS'!E779","v":0},0,0,0,0,0]
[151,772,{"$f":"'PR-RAS'!D780","v":0},{"$f":"'PR-RAS'!E780","v":0},0,0,0,0,0]
[151,773,{"$f":"'PR-RAS'!D781","v":0},{"$f":"'PR-RAS'!E781","v":0},0,0,0,0,0]
[151,774,{"$f":"'PR-RAS'!D782","v":0},{"$f":"'PR-RAS'!E782","v":0},0,0,0,0,0]
[151,775,{"$f":"'PR-RAS'!D783","v":0},{"$f":"'PR-RAS'!E783","v":0},0,0,0,0,0]
[151,776,{"$f":"'PR-RAS'!D784","v":0},{"$f":"'PR-RAS'!E784","v":0},0,0,0,0,0]
[151,777,{"$f":"'PR-RAS'!D785","v":0},{"$f":"'PR-RAS'!E785","v":0},0,0,0,0,0]
[151,778,{"$f":"'PR-RAS'!D786","v":0},{"$f":"'PR-RAS'!E786","v":0},0,0,0,0,0]
[151,779,{"$f":"'PR-RAS'!D787","v":0},{"$f":"'PR-RAS'!E787","v":0},0,0,0,0,0]
[151,780,{"$f":"'PR-RAS'!D788","v":0},{"$f":"'PR-RAS'!E788","v":0},0,0,0,0,0]
[151,781,{"$f":"'PR-RAS'!D789","v":0},{"$f":"'PR-RAS'!E789","v":0},0,0,0,0,0]
[151,782,{"$f":"'PR-RAS'!D790","v":0},{"$f":"'PR-RAS'!E790","v":0},0,0,0,0,0]
[151,783,{"$f":"'PR-RAS'!D791","v":0},{"$f":"'PR-RAS'!E791","v":0},0,0,0,0,0]
[151,784,{"$f":"'PR-RAS'!D792","v":0},{"$f":"'PR-RAS'!E792","v":0},0,0,0,0,0]
[151,785,{"$f":"'PR-RAS'!D793","v":0},{"$f":"'PR-RAS'!E793","v":0},0,0,0,0,0]
[151,786,{"$f":"'PR-RAS'!D794","v":0},{"$f":"'PR-RAS'!E794","v":0},0,0,0,0,0]
[151,787,{"$f":"'PR-RAS'!D795","v":0},{"$f":"'PR-RAS'!E795","v":0},0,0,0,0,0]
[151,788,{"$f":"'PR-RAS'!D796","v":0},{"$f":"'PR-RAS'!E796","v":0},0,0,0,0,0]
[151,789,{"$f":"'PR-RAS'!D797","v":0},{"$f":"'PR-RAS'!E797","v":0},0,0,0,0,0]
[151,790,{"$f":"'PR-RAS'!D798","v":0},{"$f":"'PR-RAS'!E798","v":0},0,0,0,0,0]
[151,791,{"$f":"'PR-RAS'!D799","v":0},{"$f":"'PR-RAS'!E799","v":0},0,0,0,0,0]
[151,792,{"$f":"'PR-RAS'!D800","v":0},{"$f":"'PR-RAS'!E800","v":0},0,0,0,0,0]
[151,793,{"$f":"'PR-RAS'!D801","v":0},{"$f":"'PR-RAS'!E801","v":0},0,0,0,0,0]
[151,794,{"$f":"'PR-RAS'!D802","v":0},{"$f":"'PR-RAS'!E802","v":0},0,0,0,0,0]
[151,795,{"$f":"'PR-RAS'!D803","v":0},{"$f":"'PR-RAS'!E803","v":0},0,0,0,0,0]
[151,796,{"$f":"'PR-RAS'!D804","v":0},{"$f":"'PR-RAS'!E804","v":0},0,0,0,0,0]
[151,797,{"$f":"'PR-RAS'!D805","v":0},{"$f":"'PR-RAS'!E805","v":0},0,0,0,0,0]
[151,798,{"$f":"'PR-RAS'!D806","v":0},{"$f":"'PR-RAS'!E806","v":0},0,0,0,0,0]
[151,799,{"$f":"'PR-RAS'!D807","v":0},{"$f":"'PR-RAS'!E807","v":0},0,0,0,0,0]
[151,800,{"$f":"'PR-RAS'!D808","v":0},{"$f":"'PR-RAS'!E808","v":0},0,0,0,0,0]
[151,801,{"$f":"'PR-RAS'!D809","v":0},{"$f":"'PR-RAS'!E809","v":0},0,0,0,0,0]
[151,802,{"$f":"'PR-RAS'!D810","v":0},{"$f":"'PR-RAS'!E810","v":0},0,0,0,0,0]
[151,803,{"$f":"'PR-RAS'!D811","v":0},{"$f":"'PR-RAS'!E811","v":0},0,0,0,0,0]
[151,804,{"$f":"'PR-RAS'!D812","v":0},{"$f":"'PR-RAS'!E812","v":0},0,0,0,0,0]
[151,805,{"$f":"'PR-RAS'!D813","v":0},{"$f":"'PR-RAS'!E813","v":0},0,0,0,0,0]
[151,806,{"$f":"'PR-RAS'!D814","v":0},{"$f":"'PR-RAS'!E814","v":0},0,0,0,0,0]
[151,807,{"$f":"'PR-RAS'!D815","v":0},{"$f":"'PR-RAS'!E815","v":0},0,0,0,0,0]
[151,808,{"$f":"'PR-RAS'!D816","v":0},{"$f":"'PR-RAS'!E816","v":0},0,0,0,0,0]
[151,809,{"$f":"'PR-RAS'!D817","v":0},{"$f":"'PR-RAS'!E817","v":0},0,0,{"$f":"(B810/1000)*(C810*1+D810*2)","v":0},{"$f":"ABS(C810-ROUND(C810,0))+ABS(D810-ROUND(D810,0))","v":0},0]
[151,810,{"$f":"'PR-RAS'!D818","v":0},{"$f":"'PR-RAS'!E818","v":0},0,0,0,0,0]
[151,811,{"$f":"'PR-RAS'!D819","v":0},{"$f":"'PR-RAS'!E819","v":0},0,0,0,0,0]
[151,812,{"$f":"'PR-RAS'!D820","v":0},{"$f":"'PR-RAS'!E820","v":0},0,0,0,0,0]
[151,813,{"$f":"'PR-RAS'!D821","v":0},{"$f":"'PR-RAS'!E821","v":0},0,0,0,0,0]
[151,814,{"$f":"'PR-RAS'!D822","v":0},{"$f":"'PR-RAS'!E822","v":0},0,0,0,0,0]
[151,815,{"$f":"'PR-RAS'!D823","v":0},{"$f":"'PR-RAS'!E823","v":0},0,0,0,0,0]
[151,816,{"$f":"'PR-RAS'!D824","v":0},{"$f":"'PR-RAS'!E824","v":0},0,0,0,0,0]
[151,817,{"$f":"'PR-RAS'!D825","v":0},{"$f":"'PR-RAS'!E825","v":0},0,0,0,0,0]
[151,818,{"$f":"'PR-RAS'!D826","v":0},{"$f":"'PR-RAS'!E826","v":0},0,0,0,0,0]
[151,819,{"$f":"'PR-RAS'!D827","v":0},{"$f":"'PR-RAS'!E827","v":0},0,0,0,0,0]
[151,820,{"$f":"'PR-RAS'!D828","v":0},{"$f":"'PR-RAS'!E828","v":0},0,0,0,0,0]
[151,821,{"$f":"'PR-RAS'!D829","v":0},{"$f":"'PR-RAS'!E829","v":0},0,0,0,0,0]
[151,822,{"$f":"'PR-RAS'!D830","v":0},{"$f":"'PR-RAS'!E830","v":0},0,0,0,0,0]
[151,823,{"$f":"'PR-RAS'!D831","v":0},{"$f":"'PR-RAS'!E831","v":0},0,0,0,0,0]
[151,824,{"$f":"'PR-RAS'!D832","v":0},{"$f":"'PR-RAS'!E832","v":0},0,0,0,0,0]
[151,825,{"$f":"'PR-RAS'!D833","v":0},{"$f":"'PR-RAS'!E833","v":0},0,0,0,0,0]
[151,826,{"$f":"'PR-RAS'!D834","v":0},{"$f":"'PR-RAS'!E834","v":0},0,0,0,0,0]
[151,827,{"$f":"'PR-RAS'!D835","v":0},{"$f":"'PR-RAS'!E835","v":0},0,0,0,0,0]
[151,828,{"$f":"'PR-RAS'!D836","v":0},{"$f":"'PR-RAS'!E836","v":0},0,0,0,0,0]
[151,829,{"$f":"'PR-RAS'!D837","v":0},{"$f":"'PR-RAS'!E837","v":0},0,0,0,0,0]
[151,830,{"$f":"'PR-RAS'!D838","v":0},{"$f":"'PR-RAS'!E838","v":0},0,0,0,0,0]
[151,831,{"$f":"'PR-RAS'!D839","v":0},{"$f":"'PR-RAS'!E839","v":0},0,0,0,0,0]
[151,832,{"$f":"'PR-RAS'!D840","v":0},{"$f":"'PR-RAS'!E840","v":0},0,0,0,0,0]
[151,833,{"$f":"'PR-RAS'!D841","v":0},{"$f":"'PR-RAS'!E841","v":0},0,0,0,0,0]
[151,834,{"$f":"'PR-RAS'!D842","v":0},{"$f":"'PR-RAS'!E842","v":0},0,0,0,0,0]
[151,835,{"$f":"'PR-RAS'!D843","v":0},{"$f":"'PR-RAS'!E843","v":0},0,0,{"$f":"(B836/1000)*(C836*1+D836*2)","v":0},{"$f":"ABS(C836-ROUND(C836,0))+ABS(D836-ROUND(D836,0))","v":0},0]
[151,836,{"$f":"'PR-RAS'!D844","v":0},{"$f":"'PR-RAS'!E844","v":0},0,0,0,0,0]
[151,837,{"$f":"'PR-RAS'!D845","v":0},{"$f":"'PR-RAS'!E845","v":0},0,0,0,0,0]
[151,838,{"$f":"'PR-RAS'!D846","v":0},{"$f":"'PR-RAS'!E846","v":0},0,0,0,0,0]
[151,839,{"$f":"'PR-RAS'!D847","v":0},{"$f":"'PR-RAS'!E847","v":0},0,0,0,0,0]
[151,840,{"$f":"'PR-RAS'!D848","v":0},{"$f":"'PR-RAS'!E848","v":0},0,0,0,0,0]
[151,841,{"$f":"'PR-RAS'!D849","v":0},{"$f":"'PR-RAS'!E849","v":0},0,0,0,0,0]
[151,842,{"$f":"'PR-RAS'!D850","v":0},{"$f":"'PR-RAS'!E850","v":0},0,0,0,0,0]
[151,843,{"$f":"'PR-RAS'!D851","v":0},{"$f":"'PR-RAS'!E851","v":0},0,0,0,0,0]
[151,844,{"$f":"'PR-RAS'!D852","v":0},{"$f":"'PR-RAS'!E852","v":0},0,0,0,0,0]
[151,845,{"$f":"'PR-RAS'!D853","v":0},{"$f":"'PR-RAS'!E853","v":0},0,0,0,0,0]
[151,846,{"$f":"'PR-RAS'!D854","v":0},{"$f":"'PR-RAS'!E854","v":0},0,0,0,0,0]
[151,847,{"$f":"'PR-RAS'!D855","v":0},{"$f":"'PR-RAS'!E855","v":0},0,0,0,0,0]
[151,848,{"$f":"'PR-RAS'!D856","v":0},{"$f":"'PR-RAS'!E856","v":0},0,0,0,0,0]
[151,849,{"$f":"'PR-RAS'!D857","v":0},{"$f":"'PR-RAS'!E857","v":0},0,0,0,0,0]
[151,850,{"$f":"'PR-RAS'!D858","v":0},{"$f":"'PR-RAS'!E858","v":0},0,0,0,0,0]
[151,851,{"$f":"'PR-RAS'!D859","v":0},{"$f":"'PR-RAS'!E859","v":0},0,0,0,0,0]
[151,852,{"$f":"'PR-RAS'!D860","v":0},{"$f":"'PR-RAS'!E860","v":0},0,0,0,0,0]
[151,853,{"$f":"'PR-RAS'!D861","v":0},{"$f":"'PR-RAS'!E861","v":0},0,0,0,0,0]
[151,854,{"$f":"'PR-RAS'!D862","v":0},{"$f":"'PR-RAS'!E862","v":0},0,0,0,0,0]
[151,855,{"$f":"'PR-RAS'!D863","v":0},{"$f":"'PR-RAS'!E863","v":0},0,0,0,0,0]
[151,856,{"$f":"'PR-RAS'!D864","v":0},{"$f":"'PR-RAS'!E864","v":0},0,0,0,0,0]
[151,857,{"$f":"'PR-RAS'!D865","v":0},{"$f":"'PR-RAS'!E865","v":0},0,0,0,0,0]
[151,858,{"$f":"'PR-RAS'!D866","v":0},{"$f":"'PR-RAS'!E866","v":0},0,0,0,0,0]
[151,859,{"$f":"'PR-RAS'!D867","v":0},{"$f":"'PR-RAS'!E867","v":0},0,0,0,0,0]
[151,860,{"$f":"'PR-RAS'!D868","v":0},{"$f":"'PR-RAS'!E868","v":0},0,0,0,0,0]
[151,861,{"$f":"'PR-RAS'!D869","v":0},{"$f":"'PR-RAS'!E869","v":0},0,0,0,0,0]
[151,862,{"$f":"'PR-RAS'!D870","v":0},{"$f":"'PR-RAS'!E870","v":0},0,0,0,0,0]
[151,863,{"$f":"'PR-RAS'!D871","v":0},{"$f":"'PR-RAS'!E871","v":0},0,0,0,0,0]
[151,864,{"$f":"'PR-RAS'!D872","v":0},{"$f":"'PR-RAS'!E872","v":0},0,0,0,0,0]
[151,865,{"$f":"'PR-RAS'!D873","v":0},{"$f":"'PR-RAS'!E873","v":0},0,0,0,0,0]
[151,866,{"$f":"'PR-RAS'!D874","v":0},{"$f":"'PR-RAS'!E874","v":0},0,0,0,0,0]
[151,867,{"$f":"'PR-RAS'!D875","v":0},{"$f":"'PR-RAS'!E875","v":0},0,0,0,0,0]
[151,868,{"$f":"'PR-RAS'!D876","v":0},{"$f":"'PR-RAS'!E876","v":0},0,0,0,0,0]
[151,869,{"$f":"'PR-RAS'!D877","v":0},{"$f":"'PR-RAS'!E877","v":0},0,0,0,0,0]
[151,870,{"$f":"'PR-RAS'!D878","v":0},{"$f":"'PR-RAS'!E878","v":0},0,0,0,0,0]
[151,871,{"$f":"'PR-RAS'!D879","v":0},{"$f":"'PR-RAS'!E879","v":0},0,0,0,0,0]
[151,872,{"$f":"'PR-RAS'!D880","v":0},{"$f":"'PR-RAS'!E880","v":0},0,0,0,0,0]
[151,873,{"$f":"'PR-RAS'!D881","v":0},{"$f":"'PR-RAS'!E881","v":0},0,0,0,0,0]
[151,874,{"$f":"'PR-RAS'!D882","v":0},{"$f":"'PR-RAS'!E882","v":0},0,0,0,0,0]
[151,875,{"$f":"'PR-RAS'!D883","v":0},{"$f":"'PR-RAS'!E883","v":0},0,0,0,0,0]
[151,876,{"$f":"'PR-RAS'!D884","v":0},{"$f":"'PR-RAS'!E884","v":0},0,0,0,0,0]
[151,877,{"$f":"'PR-RAS'!D885","v":0},{"$f":"'PR-RAS'!E885","v":0},0,0,0,0,0]
[151,878,{"$f":"'PR-RAS'!D886","v":0},{"$f":"'PR-RAS'!E886","v":0},0,0,0,0,0]
[151,879,{"$f":"'PR-RAS'!D887","v":0},{"$f":"'PR-RAS'!E887","v":0},0,0,0,0,0]
[151,880,{"$f":"'PR-RAS'!D888","v":0},{"$f":"'PR-RAS'!E888","v":0},0,0,0,0,0]
[151,881,{"$f":"'PR-RAS'!D889","v":0},{"$f":"'PR-RAS'!E889","v":0},0,0,0,0,0]
[151,882,{"$f":"'PR-RAS'!D890","v":0},{"$f":"'PR-RAS'!E890","v":0},0,0,0,0,0]
[151,883,{"$f":"'PR-RAS'!D891","v":0},{"$f":"'PR-RAS'!E891","v":0},0,0,0,0,0]
[151,884,{"$f":"'PR-RAS'!D892","v":0},{"$f":"'PR-RAS'!E892","v":0},0,0,0,0,0]
[151,885,{"$f":"'PR-RAS'!D893","v":0},{"$f":"'PR-RAS'!E893","v":0},0,0,0,0,0]
[151,886,{"$f":"'PR-RAS'!D894","v":0},{"$f":"'PR-RAS'!E894","v":0},0,0,0,0,0]
[151,887,{"$f":"'PR-RAS'!D895","v":0},{"$f":"'PR-RAS'!E895","v":0},0,0,0,0,0]
[151,888,{"$f":"'PR-RAS'!D896","v":0},{"$f":"'PR-RAS'!E896","v":0},0,0,0,0,0]
[151,889,{"$f":"'PR-RAS'!D897","v":0},{"$f":"'PR-RAS'!E897","v":0},0,0,0,0,0]
[151,890,{"$f":"'PR-RAS'!D898","v":0},{"$f":"'PR-RAS'!E898","v":0},0,0,0,0,0]
[151,891,{"$f":"'PR-RAS'!D899","v":0},{"$f":"'PR-RAS'!E899","v":0},0,0,0,0,0]
[151,892,{"$f":"'PR-RAS'!D900","v":0},{"$f":"'PR-RAS'!E900","v":0},0,0,0,0,0]
[151,893,{"$f":"'PR-RAS'!D901","v":0},{"$f":"'PR-RAS'!E901","v":0},0,0,0,0,0]
[151,894,{"$f":"'PR-RAS'!D902","v":0},{"$f":"'PR-RAS'!E902","v":0},0,0,0,0,0]
[151,895,{"$f":"'PR-RAS'!D903","v":0},{"$f":"'PR-RAS'!E903","v":0},0,0,0,0,0]
[151,896,{"$f":"'PR-RAS'!D904","v":0},{"$f":"'PR-RAS'!E904","v":0},0,0,0,0,0]
[151,897,{"$f":"'PR-RAS'!D905","v":0},{"$f":"'PR-RAS'!E905","v":0},0,0,0,0,0]
[151,898,{"$f":"'PR-RAS'!D906","v":0},{"$f":"'PR-RAS'!E906","v":0},0,0,0,0,0]
[151,899,{"$f":"'PR-RAS'!D907","v":0},{"$f":"'PR-RAS'!E907","v":0},0,0,0,0,0]
[151,900,{"$f":"'PR-RAS'!D908","v":0},{"$f":"'PR-RAS'!E908","v":0},0,0,0,0,0]
[151,901,{"$f":"'PR-RAS'!D909","v":0},{"$f":"'PR-RAS'!E909","v":0},0,0,0,0,0]
[151,902,{"$f":"'PR-RAS'!D910","v":0},{"$f":"'PR-RAS'!E910","v":0},0,0,0,0,0]
[151,903,{"$f":"'PR-RAS'!D911","v":0},{"$f":"'PR-RAS'!E911","v":0},0,0,0,0,0]
[151,904,{"$f":"'PR-RAS'!D912","v":0},{"$f":"'PR-RAS'!E912","v":0},0,0,0,0,0]
[151,905,{"$f":"'PR-RAS'!D913","v":0},{"$f":"'PR-RAS'!E913","v":0},0,0,0,0,0]
[151,906,{"$f":"'PR-RAS'!D914","v":0},{"$f":"'PR-RAS'!E914","v":0},0,0,0,0,0]
[151,907,{"$f":"'PR-RAS'!D915","v":0},{"$f":"'PR-RAS'!E915","v":0},0,0,0,0,0]
[151,908,{"$f":"'PR-RAS'!D916","v":0},{"$f":"'PR-RAS'!E916","v":0},0,0,0,0,0]
[151,909,{"$f":"'PR-RAS'!D917","v":0},{"$f":"'PR-RAS'!E917","v":0},0,0,0,0,0]
[151,910,{"$f":"'PR-RAS'!D918","v":0},{"$f":"'PR-RAS'!E918","v":0},0,0,0,0,0]
[151,911,{"$f":"'PR-RAS'!D919","v":0},{"$f":"'PR-RAS'!E919","v":0},0,0,0,0,0]
[151,912,{"$f":"'PR-RAS'!D920","v":0},{"$f":"'PR-RAS'!E920","v":0},0,0,0,0,0]
[151,913,{"$f":"'PR-RAS'!D921","v":0},{"$f":"'PR-RAS'!E921","v":0},0,0,0,0,0]
[151,914,{"$f":"'PR-RAS'!D922","v":0},{"$f":"'PR-RAS'!E922","v":0},0,0,0,0,0]
[151,915,{"$f":"'PR-RAS'!D923","v":0},{"$f":"'PR-RAS'!E923","v":0},0,0,0,0,0]
[151,916,{"$f":"'PR-RAS'!D924","v":0},{"$f":"'PR-RAS'!E924","v":0},0,0,0,0,0]
[151,917,{"$f":"'PR-RAS'!D925","v":0},{"$f":"'PR-RAS'!E925","v":0},0,0,0,0,0]
[151,918,{"$f":"'PR-RAS'!D926","v":0},{"$f":"'PR-RAS'!E926","v":0},0,0,0,0,0]
[151,919,{"$f":"'PR-RAS'!D927","v":0},{"$f":"'PR-RAS'!E927","v":0},0,0,0,0,0]
[151,920,{"$f":"'PR-RAS'!D928","v":0},{"$f":"'PR-RAS'!E928","v":0},0,0,0,0,0]
[151,921,{"$f":"'PR-RAS'!D929","v":0},{"$f":"'PR-RAS'!E929","v":0},0,0,0,0,0]
[151,922,{"$f":"'PR-RAS'!D930","v":0},{"$f":"'PR-RAS'!E930","v":0},0,0,0,0,0]
[151,923,{"$f":"'PR-RAS'!D931","v":0},{"$f":"'PR-RAS'!E931","v":0},0,0,0,0,0]
[151,924,{"$f":"'PR-RAS'!D932","v":0},{"$f":"'PR-RAS'!E932","v":0},0,0,0,0,0]
[151,925,{"$f":"'PR-RAS'!D933","v":0},{"$f":"'PR-RAS'!E933","v":0},0,0,0,0,0]
[151,926,{"$f":"'PR-RAS'!D934","v":0},{"$f":"'PR-RAS'!E934","v":0},0,0,0,0,0]
[151,927,{"$f":"'PR-RAS'!D935","v":0},{"$f":"'PR-RAS'!E935","v":0},0,0,0,0,0]
[151,928,{"$f":"'PR-RAS'!D936","v":0},{"$f":"'PR-RAS'!E936","v":0},0,0,0,0,0]
[151,929,{"$f":"'PR-RAS'!D937","v":0},{"$f":"'PR-RAS'!E937","v":0},0,0,0,0,0]
[151,930,{"$f":"'PR-RAS'!D938","v":0},{"$f":"'PR-RAS'!E938","v":0},0,0,0,0,0]
[151,931,{"$f":"'PR-RAS'!D939","v":0},{"$f":"'PR-RAS'!E939","v":0},0,0,0,0,0]
[151,932,{"$f":"'PR-RAS'!D940","v":0},{"$f":"'PR-RAS'!E940","v":0},0,0,0,0,0]
[151,933,{"$f":"'PR-RAS'!D941","v":0},{"$f":"'PR-RAS'!E941","v":0},0,0,0,0,0]
[151,934,{"$f":"'PR-RAS'!D942","v":0},{"$f":"'PR-RAS'!E942","v":0},0,0,0,0,0]
[151,935,{"$f":"'PR-RAS'!D943","v":0},{"$f":"'PR-RAS'!E943","v":0},0,0,0,0,0]
[151,936,{"$f":"'PR-RAS'!D944","v":0},{"$f":"'PR-RAS'!E944","v":0},0,0,0,0,0]
[151,937,{"$f":"'PR-RAS'!D945","v":0},{"$f":"'PR-RAS'!E945","v":0},0,0,0,0,0]
[151,938,{"$f":"'PR-RAS'!D946","v":0},{"$f":"'PR-RAS'!E946","v":0},0,0,0,0,0]
[151,939,{"$f":"'PR-RAS'!D947","v":0},{"$f":"'PR-RAS'!E947","v":0},0,0,0,0,0]
[151,940,{"$f":"'PR-RAS'!D948","v":0},{"$f":"'PR-RAS'!E948","v":0},0,0,0,0,0]
[151,941,{"$f":"'PR-RAS'!D949","v":0},{"$f":"'PR-RAS'!E949","v":0},0,0,0,0,0]
[151,942,{"$f":"'PR-RAS'!D950","v":0},{"$f":"'PR-RAS'!E950","v":0},0,0,0,0,0]
[151,943,{"$f":"'PR-RAS'!D951","v":0},{"$f":"'PR-RAS'!E951","v":0},0,0,0,0,0]
[151,944,{"$f":"'PR-RAS'!D952","v":0},{"$f":"'PR-RAS'!E952","v":0},0,0,0,0,0]
[151,945,{"$f":"'PR-RAS'!D953","v":0},{"$f":"'PR-RAS'!E953","v":0},0,0,0,0,0]
[151,946,{"$f":"'PR-RAS'!D954","v":0},{"$f":"'PR-RAS'!E954","v":0},0,0,0,0,0]
[151,947,{"$f":"'PR-RAS'!D955","v":0},{"$f":"'PR-RAS'!E955","v":0},0,0,0,0,0]
[151,948,{"$f":"'PR-RAS'!D956","v":0},{"$f":"'PR-RAS'!E956","v":0},0,0,0,0,0]
[151,949,{"$f":"'PR-RAS'!D957","v":0},{"$f":"'PR-RAS'!E957","v":0},0,0,0,0,0]
[151,950,{"$f":"'PR-RAS'!D958","v":0},{"$f":"'PR-RAS'!E958","v":0},0,0,0,0,0]
[151,951,{"$f":"'PR-RAS'!D959","v":0},{"$f":"'PR-RAS'!E959","v":0},0,0,0,0,0]
[151,952,{"$f":"'PR-RAS'!D960","v":0},{"$f":"'PR-RAS'!E960","v":0},0,0,0,0,0]
[151,953,{"$f":"'PR-RAS'!D961","v":0},{"$f":"'PR-RAS'!E961","v":0},0,0,0,0,0]
[151,954,{"$f":"'PR-RAS'!D962","v":0},{"$f":"'PR-RAS'!E962","v":0},0,0,0,0,0]
[151,955,{"$f":"'PR-RAS'!D963","v":0},{"$f":"'PR-RAS'!E963","v":0},0,0,0,0,0]
[151,956,{"$f":"'PR-RAS'!D964","v":0},{"$f":"'PR-RAS'!E964","v":0},0,0,0,0,0]
[151,957,{"$f":"'PR-RAS'!D965","v":0},{"$f":"'PR-RAS'!E965","v":0},0,0,0,0,0]
[151,958,{"$f":"'PR-RAS'!D966","v":0},{"$f":"'PR-RAS'!E966","v":0},0,0,0,0,0]
[151,959,{"$f":"'PR-RAS'!D967","v":0},{"$f":"'PR-RAS'!E967","v":0},0,0,0,0,0]
[151,960,{"$f":"'PR-RAS'!D968","v":0},{"$f":"'PR-RAS'!E968","v":0},0,0,0,0,0]
[151,961,{"$f":"'PR-RAS'!D969","v":0},{"$f":"'PR-RAS'!E969","v":0},0,0,0,0,0]
[151,962,{"$f":"'PR-RAS'!D970","v":0},{"$f":"'PR-RAS'!E970","v":0},0,0,0,0,0]
[151,963,{"$f":"'PR-RAS'!D971","v":0},{"$f":"'PR-RAS'!E971","v":0},0,0,0,0,0]
[151,964,{"$f":"'PR-RAS'!D972","v":0},{"$f":"'PR-RAS'!E972","v":0},0,0,0,0,0]
[151,965,{"$f":"'PR-RAS'!D973","v":0},{"$f":"'PR-RAS'!E973","v":0},0,0,0,0,0]
[151,966,{"$f":"'PR-RAS'!D974","v":0},{"$f":"'PR-RAS'!E974","v":0},0,0,0,0,0]
[151,967,{"$f":"'PR-RAS'!D975","v":0},{"$f":"'PR-RAS'!E975","v":0},0,0,0,0,0]
[151,968,{"$f":"'PR-RAS'!D976","v":0},{"$f":"'PR-RAS'!E976","v":0},0,0,0,0,0]
[151,969,{"$f":"'PR-RAS'!D977","v":0},{"$f":"'PR-RAS'!E977","v":0},0,0,0,0,0]
[151,970,{"$f":"'PR-RAS'!D978","v":0},{"$f":"'PR-RAS'!E978","v":0},0,0,0,0,0]
[151,971,{"$f":"'PR-RAS'!D979","v":0},{"$f":"'PR-RAS'!E979","v":0},0,0,0,0,0]
[151,972,{"$f":"'PR-RAS'!D980","v":0},{"$f":"'PR-RAS'!E980","v":0},0,0,0,0,0]
[151,973,{"$f":"'PR-RAS'!D981","v":0},{"$f":"'PR-RAS'!E981","v":0},0,0,0,0,0]
[151,974,{"$f":"'PR-RAS'!D982","v":0},{"$f":"'PR-RAS'!E982","v":0},0,0,0,0,0]
[151,975,{"$f":"'PR-RAS'!D985","v":0},{"$f":"'PR-RAS'!E985","v":0},0,0,0,0,0]
[151,976,{"$f":"'PR-RAS'!D986","v":0},{"$f":"'PR-RAS'!E986","v":0},0,0,0,0,0]
[151,977,{"$f":"'PR-RAS'!D987","v":0},{"$f":"'PR-RAS'!E987","v":0},0,0,0,0,0]
[151,978,{"$f":"'PR-RAS'!D988","v":0},{"$f":"'PR-RAS'!E988","v":0},0,0,0,0,0]
[151,979,{"$f":"'PR-RAS'!D989","v":0},{"$f":"'PR-RAS'!E989","v":0},0,0,0,0,0]
[151,980,{"$f":"'PR-RAS'!D990","v":0},{"$f":"'PR-RAS'!E990","v":0},0,0,0,0,0]
[151,981,{"$f":"'PR-RAS'!D991","v":0},{"$f":"'PR-RAS'!E991","v":0},0,0,0,0,0]
[151,982,{"$f":"'PR-RAS'!D992","v":0},{"$f":"'PR-RAS'!E992","v":0},0,0,0,0,0]
[152,1,{"$f":"BILANCA!D6","v":77393.370000000039},{"$f":"BILANCA!E6","v":73517.42},0,0,{"$f":"B984/1000*C984+B984/500*D984","v":224.42821000000004},0.7900000000372529]
[152,2,{"$f":"BILANCA!D7","v":66223.130000000034},{"$f":"BILANCA!E7","v":62411.69},0,0,382.09302000000008,0.44000000003143214]
[152,3,{"$f":"BILANCA!D8","v":0},{"$f":"BILANCA!E8","v":0},0,0,0,0]
[152,4,{"$f":"BILANCA!D9","v":0},{"$f":"BILANCA!E9","v":0},0,0,0,0]
[152,5,{"$f":"BILANCA!D10","v":0},{"$f":"BILANCA!E10","v":0},0,0,0,0]
[152,6,{"$f":"BILANCA!D11","v":0},{"$f":"BILANCA!E11","v":0},0,0,0,0]
[152,7,{"$f":"BILANCA!D12","v":66223.130000000034},{"$f":"BILANCA!E12","v":62411.69},0,0,1337.3255700000004,0.44000000003143214]
[152,8,{"$f":"BILANCA!D13","v":0},{"$f":"BILANCA!E13","v":0},0,0,0,0]
[152,9,{"$f":"BILANCA!D14","v":0},{"$f":"BILANCA!E14","v":0},0,0,0,0]
[152,10,{"$f":"BILANCA!D15","v":0},{"$f":"BILANCA!E15","v":0},0,0,0,0]
[152,11,{"$f":"BILANCA!D16","v":0},{"$f":"BILANCA!E16","v":0},0,0,0,0]
[152,12,{"$f":"BILANCA!D17","v":0},{"$f":"BILANCA!E17","v":0},0,0,0,0]
[152,13,{"$f":"BILANCA!D18","v":0},{"$f":"BILANCA!E18","v":0},0,0,0,0]
[152,14,{"$f":"BILANCA!D19","v":5291.0500000000175},{"$f":"BILANCA!E19","v":5434.820000000007},0,0,226.24966000000046,0.23000000001047738]
[152,15,{"$f":"BILANCA!D20","v":88887.6},{"$f":"BILANCA!E20","v":88835.66},0,0,3998.3838000000005,0.73999999999068677]
[152,16,{"$f":"BILANCA!D21","v":4592.1000000000004},{"$f":"BILANCA!E21","v":4592.1000000000004},0,0,220.42080000000001,0.2000000000007276]
[152,17,{"$f":"BILANCA!D22","v":2714.07},{"$f":"BILANCA!E22","v":2714.08},0,0,138.41791000000001,0.15000000000009095]
[152,18,{"$f":"BILANCA!D23","v":0},{"$f":"BILANCA!E23","v":0},0,0,0,0]
[152,19,{"$f":"BILANCA!D24","v":0},{"$f":"BILANCA!E24","v":0},0,0,0,0]
[152,20,{"$f":"BILANCA!D25","v":0},{"$f":"BILANCA!E25","v":0},0,0,0,0]
[152,21,{"$f":"BILANCA!D26","v":2360.0300000000002},{"$f":"BILANCA!E26","v":2685.04},0,0,162.33231000000001,7.0000000000163709E-2]
[152,22,{"$f":"BILANCA!D27","v":0},{"$f":"BILANCA!E27","v":0},0,0,0,0]
[152,23,{"$f":"BILANCA!D28","v":93262.75},{"$f":"BILANCA!E28","v":93392.06},0,0,6441.0780099999993,0.30999999999767169]
[152,24,{"$f":"BILANCA!D29","v":0},{"$f":"BILANCA!E29","v":0},0,0,0,0]
[152,25,{"$f":"BILANCA!D30","v":0},{"$f":"BILANCA!E30","v":0},0,0,0,0]
[152,26,{"$f":"BILANCA!D31","v":0},{"$f":"BILANCA!E31","v":0},0,0,0,0]
[152,27,{"$f":"BILANCA!D32","v":0},{"$f":"BILANCA!E32","v":0},0,0,0,0]
[152,28,{"$f":"BILANCA!D33","v":0},{"$f":"BILANCA!E33","v":0},0,0,0,0]
[152,29,{"$f":"BILANCA!D34","v":0},{"$f":"BILANCA!E34","v":0},0,0,0,0]
[152,30,{"$f":"BILANCA!D35","v":40845.260000000009},{"$f":"BILANCA!E35","v":47528.119999999995},0,0,4077.0449999999996,0.38000000000465661]
[152,31,{"$f":"BILANCA!D36","v":289146},{"$f":"BILANCA!E36","v":313377.13},0,0,28392.908060000002,0.13000000000465661]
[152,32,{"$f":"BILANCA!D37","v":0},{"$f":"BILANCA!E37","v":0},0,0,0,0]
[152,33,{"$f":"BILANCA!D38","v":0},{"$f":"BILANCA!E38","v":0},0,0,0,0]
[152,34,{"$f":"BILANCA!D39","v":0},{"$f":"BILANCA!E39","v":0},0,0,0,0]
[152,35,{"$f":"BILANCA!D40","v":248300.74},{"$f":"BILANCA!E40","v":265849.01},0,0,27299.956600000001,0.27000000001862645]
[152,36,{"$f":"BILANCA!D41","v":0},{"$f":"BILANCA!E41","v":0},0,0,0,0]
[152,37,{"$f":"BILANCA!D42","v":0},{"$f":"BILANCA!E42","v":0},0,0,0,0]
[152,38,{"$f":"BILANCA!D43","v":0},{"$f":"BILANCA!E43","v":0},0,0,0,0]
[152,39,{"$f":"BILANCA!D44","v":0},{"$f":"BILANCA!E44","v":0},0,0,0,0]
[152,40,{"$f":"BILANCA!D45","v":20086.82},{"$f":"BILANCA!E45","v":9448.7500000000036},0,0,1559.3728000000003,0.42999999999665306]
[152,41,{"$f":"BILANCA!D46","v":0},{"$f":"BILANCA!E46","v":0},0,0,0,0]
[152,42,{"$f":"BILANCA!D47","v":6334.93},{"$f":"BILANCA!E47","v":6334.92},0,0,798.2003400000001,0.1499999999996362]
[152,43,{"$f":"BILANCA!D48","v":26804.959999999999},{"$f":"BILANCA!E48","v":27467.09},0,0,3514.7830199999999,0.13000000000101863]
[152,44,{"$f":"BILANCA!D49","v":33768},{"$f":"BILANCA!E49","v":0},0,0,1485.7919999999999,0]
[152,45,{"$f":"BILANCA!D50","v":46821.07},{"$f":"BILANCA!E50","v":24353.26},0,0,4298.7415499999988,0.32999999999810825]
[152,46,{"$f":"BILANCA!D51","v":0},{"$f":"BILANCA!E51","v":0},0,0,0,0]
[152,47,{"$f":"BILANCA!D52","v":0},{"$f":"BILANCA!E52","v":0},0,0,0,0]
[152,48,{"$f":"BILANCA!D53","v":0},{"$f":"BILANCA!E53","v":0},0,0,0,0]
[152,49,{"$f":"BILANCA!D54","v":7117.26},{"$f":"BILANCA!E54","v":7049.65},0,0,1039.6114399999999,0.61000000000058208]
[152,50,{"$f":"BILANCA!D55","v":7117.26},{"$f":"BILANCA!E55","v":7049.65},0,0,1060.828,0.61000000000058208]
[152,51,{"$f":"BILANCA!D56","v":0},{"$f":"BILANCA!E56","v":0},0,0,0,0]
[152,52,{"$f":"BILANCA!D57","v":0},{"$f":"BILANCA!E57","v":0},0,0,0,0]
[152,53,{"$f":"BILANCA!D58","v":0},{"$f":"BILANCA!E58","v":0},0,0,0,0]
[152,54,{"$f":"BILANCA!D59","v":0},{"$f":"BILANCA!E59","v":0},0,0,0,0]
[152,55,{"$f":"BILANCA!D60","v":0},{"$f":"BILANCA!E60","v":0},0,0,0,0]
[152,56,{"$f":"BILANCA!D61","v":0},{"$f":"BILANCA!E61","v":0},0,0,0,0]
[152,57,{"$f":"BILANCA!D62","v":0},{"$f":"BILANCA!E62","v":0},0,0,0,0]
[152,58,{"$f":"BILANCA!D63","v":0},{"$f":"BILANCA!E63","v":0},0,0,0,0]
[152,59,{"$f":"BILANCA!D64","v":0},{"$f":"BILANCA!E64","v":0},0,0,0,0]
[152,60,{"$f":"BILANCA!D65","v":0},{"$f":"BILANCA!E65","v":0},0,0,0,0]
[152,61,{"$f":"BILANCA!D66","v":0},{"$f":"BILANCA!E66","v":0},0,0,0,0]
[152,62,{"$f":"BILANCA!D67","v":0},{"$f":"BILANCA!E67","v":0},0,0,0,0]
[152,63,{"$f":"BILANCA!D68","v":11170.24},{"$f":"BILANCA!E68","v":11105.73},0,0,2103.0470999999998,0.51000000000021828]
[152,64,{"$f":"BILANCA!D69","v":0},{"$f":"BILANCA!E69","v":0},0,0,0,0]
[152,65,{"$f":"BILANCA!D70","v":0},{"$f":"BILANCA!E70","v":0},0,0,0,0]
[152,66,{"$f":"BILANCA!D71","v":0},{"$f":"BILANCA!E71","v":0},0,0,0,0]
[152,67,{"$f":"BILANCA!D72","v":0},{"$f":"BILANCA!E72","v":0},0,0,0,0]
[152,68,{"$f":"BILANCA!D73","v":0},{"$f":"BILANCA!E73","v":0},0,0,0,0]
[152,69,{"$f":"BILANCA!D74","v":0},{"$f":"BILANCA!E74","v":0},0,0,0,0]
[152,70,{"$f":"BILANCA!D75","v":0},{"$f":"BILANCA!E75","v":0},0,0,0,0]
[152,71,{"$f":"BILANCA!D76","v":0},{"$f":"BILANCA!E76","v":0},0,0,0,0]
[152,72,{"$f":"BILANCA!D77","v":0},{"$f":"BILANCA!E77","v":0},0,0,0,0]
[152,73,{"$f":"BILANCA!D78","v":82.97},{"$f":"BILANCA!E78","v":54.99},0,0,14.085349999999998,3.9999999999999147E-2]
[152,74,{"$f":"BILANCA!D79","v":0},{"$f":"BILANCA!E79","v":0},0,0,0,0]
[152,75,{"$f":"BILANCA!D80","v":0},{"$f":"BILANCA!E80","v":0},0,0,0,0]
[152,76,{"$f":"BILANCA!D81","v":0},{"$f":"BILANCA!E81","v":0},0,0,0,0]
[152,77,{"$f":"BILANCA!D82","v":0},{"$f":"BILANCA!E82","v":0},0,0,0,0]
[152,78,{"$f":"BILANCA!D83","v":82.97},{"$f":"BILANCA!E83","v":54.99},0,0,15.0501,3.9999999999999147E-2]
[152,79,{"$f":"BILANCA!D84","v":0},{"$f":"BILANCA!E84","v":0},0,0,0,0]
[153,80,{"$f":"BILANCA!D85","v":0},{"$f":"BILANCA!E85","v":0},0,0,0,0]
[152,81,{"$f":"BILANCA!D86","v":0},{"$f":"BILANCA!E86","v":0},0,0,0,0]
[152,82,{"$f":"BILANCA!D87","v":0},{"$f":"BILANCA!E87","v":0},0,0,0,0]
[152,83,{"$f":"BILANCA!D88","v":0},{"$f":"BILANCA!E88","v":0},0,0,0,0]
[152,84,{"$f":"BILANCA!D89","v":0},{"$f":"BILANCA!E89","v":0},0,0,0,0]
[152,85,{"$f":"BILANCA!D90","v":0},{"$f":"BILANCA!E90","v":0},0,0,0,{"$f":"ABS(C1068-ROUND(C1068,0))+ABS(D1068-ROUND(D1068,0))","v":0}]
[152,86,{"$f":"BILANCA!D91","v":0},{"$f":"BILANCA!E91","v":0},0,0,0,0]
[152,87,{"$f":"BILANCA!D92","v":0},{"$f":"BILANCA!E92","v":0},0,0,0,0]
[152,88,{"$f":"BILANCA!D93","v":0},{"$f":"BILANCA!E93","v":0},0,0,0,0]
[152,89,{"$f":"BILANCA!D94","v":0},{"$f":"BILANCA!E94","v":0},0,0,0,0]
[152,90,{"$f":"BILANCA!D95","v":0},{"$f":"BILANCA!E95","v":0},0,0,0,0]
[152,91,{"$f":"BILANCA!D96","v":0},{"$f":"BILANCA!E96","v":0},0,0,0,0]
[152,92,{"$f":"BILANCA!D97","v":0},{"$f":"BILANCA!E97","v":0},0,0,0,0]
[152,93,{"$f":"BILANCA!D98","v":0},{"$f":"BILANCA!E98","v":0},0,0,0,0]
[152,94,{"$f":"BILANCA!D99","v":0},{"$f":"BILANCA!E99","v":0},0,0,0,0]
[152,95,{"$f":"BILANCA!D100","v":0},{"$f":"BILANCA!E100","v":0},0,0,0,0]
[152,96,{"$f":"BILANCA!D101","v":0},{"$f":"BILANCA!E101","v":0},0,0,0,0]
[152,97,{"$f":"BILANCA!D102","v":0},{"$f":"BILANCA!E102","v":0},0,0,0,0]
[152,98,{"$f":"BILANCA!D103","v":0},{"$f":"BILANCA!E103","v":0},0,0,0,0]
[152,99,{"$f":"BILANCA!D104","v":0},{"$f":"BILANCA!E104","v":0},0,0,0,0]
[152,100,{"$f":"BILANCA!D105","v":0},{"$f":"BILANCA!E105","v":0},0,0,0,0]
[152,101,{"$f":"BILANCA!D106","v":0},{"$f":"BILANCA!E106","v":0},0,0,0,0]
[152,102,{"$f":"BILANCA!D107","v":0},{"$f":"BILANCA!E107","v":0},0,0,0,0]
[152,103,{"$f":"BILANCA!D108","v":0},{"$f":"BILANCA!E108","v":0},0,0,0,0]
[152,104,{"$f":"BILANCA!D109","v":0},{"$f":"BILANCA!E109","v":0},0,0,0,0]
[152,105,{"$f":"BILANCA!D110","v":0},{"$f":"BILANCA!E110","v":0},0,0,0,0]
[152,106,{"$f":"BILANCA!D111","v":0},{"$f":"BILANCA!E111","v":0},0,0,0,0]
[152,107,{"$f":"BILANCA!D112","v":0},{"$f":"BILANCA!E112","v":0},0,0,0,0]
[152,108,{"$f":"BILANCA!D113","v":0},{"$f":"BILANCA!E113","v":0},0,0,0,0]
[152,109,{"$f":"BILANCA!D114","v":0},{"$f":"BILANCA!E114","v":0},0,0,0,0]
[152,110,{"$f":"BILANCA!D115","v":0},{"$f":"BILANCA!E115","v":0},0,0,0,0]
[152,111,{"$f":"BILANCA!D116","v":0},{"$f":"BILANCA!E116","v":0},0,0,0,0]
[152,112,{"$f":"BILANCA!D117","v":0},{"$f":"BILANCA!E117","v":0},0,0,0,0]
[152,113,{"$f":"BILANCA!D118","v":0},{"$f":"BILANCA!E118","v":0},0,0,0,0]
[152,114,{"$f":"BILANCA!D119","v":0},{"$f":"BILANCA!E119","v":0},0,0,0,0]
[152,115,{"$f":"BILANCA!D120","v":0},{"$f":"BILANCA!E120","v":0},0,0,0,0]
[152,116,{"$f":"BILANCA!D121","v":0},{"$f":"BILANCA!E121","v":0},0,0,0,0]
[152,117,{"$f":"BILANCA!D122","v":0},{"$f":"BILANCA!E122","v":0},0,0,0,0]
[152,118,{"$f":"BILANCA!D123","v":0},{"$f":"BILANCA!E123","v":0},0,0,0,0]
[152,119,{"$f":"BILANCA!D124","v":0},{"$f":"BILANCA!E124","v":0},0,0,0,0]
[152,120,{"$f":"BILANCA!D125","v":0},{"$f":"BILANCA!E125","v":0},0,0,0,0]
[152,121,{"$f":"BILANCA!D126","v":0},{"$f":"BILANCA!E126","v":0},0,0,0,0]
[152,122,{"$f":"BILANCA!D127","v":0},{"$f":"BILANCA!E127","v":0},0,0,0,0]
[152,123,{"$f":"BILANCA!D128","v":0},{"$f":"BILANCA!E128","v":0},0,0,0,0]
[152,124,{"$f":"BILANCA!D129","v":0},{"$f":"BILANCA!E129","v":0},0,0,0,0]
[152,125,{"$f":"BILANCA!D130","v":0},{"$f":"BILANCA!E130","v":0},0,0,0,0]
[152,126,{"$f":"BILANCA!D131","v":0},{"$f":"BILANCA!E131","v":0},0,0,0,0]
[152,127,{"$f":"BILANCA!D132","v":0},{"$f":"BILANCA!E132","v":0},0,0,0,0]
[152,128,{"$f":"BILANCA!D133","v":0},{"$f":"BILANCA!E133","v":0},0,0,0,0]
[152,129,{"$f":"BILANCA!D134","v":0},{"$f":"BILANCA!E134","v":0},0,0,0,0]
[152,130,{"$f":"BILANCA!D135","v":0},{"$f":"BILANCA!E135","v":0},0,0,0,0]
[152,131,{"$f":"BILANCA!D136","v":0},{"$f":"BILANCA!E136","v":0},0,0,0,0]
[152,132,{"$f":"BILANCA!D137","v":0},{"$f":"BILANCA!E137","v":0},0,0,0,0]
[152,133,{"$f":"BILANCA!D138","v":0},{"$f":"BILANCA!E138","v":0},0,0,0,0]
[152,134,{"$f":"BILANCA!D139","v":0},{"$f":"BILANCA!E139","v":0},0,0,0,0]
[152,135,{"$f":"BILANCA!D140","v":0},{"$f":"BILANCA!E140","v":0},0,0,0,0]
[152,136,{"$f":"BILANCA!D141","v":0},{"$f":"BILANCA!E141","v":0},0,0,0,0]
[152,137,{"$f":"BILANCA!D142","v":0},{"$f":"BILANCA!E142","v":0},0,0,0,0]
[152,138,{"$f":"BILANCA!D143","v":0},{"$f":"BILANCA!E143","v":0},0,0,0,0]
[152,139,{"$f":"BILANCA!D144","v":0},{"$f":"BILANCA!E144","v":0},0,0,0,0]
[152,140,{"$f":"BILANCA!D145","v":0},{"$f":"BILANCA!E145","v":0},0,0,0,0]
[152,141,{"$f":"BILANCA!D146","v":11087.27},{"$f":"BILANCA!E146","v":11050.74},0,0,4679.6137499999995,0.53000000000065484]
[152,142,{"$f":"BILANCA!D147","v":0},{"$f":"BILANCA!E147","v":0},0,0,0,0]
[152,143,{"$f":"BILANCA!D148","v":0},{"$f":"BILANCA!E148","v":0},0,0,0,0]
[152,144,{"$f":"BILANCA!D149","v":0},{"$f":"BILANCA!E149","v":0},0,0,0,0]
[152,145,{"$f":"BILANCA!D150","v":0},{"$f":"BILANCA!E150","v":0},0,0,0,0]
[152,146,{"$f":"BILANCA!D151","v":0},{"$f":"BILANCA!E151","v":0},0,0,0,0]
[152,147,{"$f":"BILANCA!D152","v":0},{"$f":"BILANCA!E152","v":0},0,0,0,0]
[152,148,{"$f":"BILANCA!D153","v":0},{"$f":"BILANCA!E153","v":0},0,0,0,0]
[152,149,{"$f":"BILANCA!D154","v":0},{"$f":"BILANCA!E154","v":0},0,0,0,0]
[152,150,{"$f":"BILANCA!D155","v":0},{"$f":"BILANCA!E155","v":0},0,0,0,0]
[152,151,{"$f":"BILANCA!D156","v":0},{"$f":"BILANCA!E156","v":0},0,0,{"$f":"B1134/1000*C1134+B1134/500*D1134","v":0},{"$f":"ABS(C1134-ROUND(C1134,0))+ABS(D1134-ROUND(D1134,0))","v":0}]
[152,152,{"$f":"BILANCA!D157","v":0},{"$f":"BILANCA!E157","v":0},0,0,0,0]
[152,153,{"$f":"BILANCA!D158","v":0},{"$f":"BILANCA!E158","v":0},0,0,0,0]
[152,154,{"$f":"BILANCA!D159","v":0},{"$f":"BILANCA!E159","v":0},0,0,0,0]
[152,155,{"$f":"BILANCA!D160","v":36.5},{"$f":"BILANCA!E160","v":7.3},0,0,7.9204999999999997,0.79999999999999982]
[152,156,{"$f":"BILANCA!D161","v":11050.77},{"$f":"BILANCA!E161","v":11043.44},0,0,5169.4733999999999,0.67000000000007276]
[152,157,{"$f":"BILANCA!D162","v":0},{"$f":"BILANCA!E162","v":0},0,0,0,0]
[152,158,{"$f":"BILANCA!D163","v":0},{"$f":"BILANCA!E163","v":0},0,0,0,0]
[152,159,{"$f":"BILANCA!D164","v":0},{"$f":"BILANCA!E164","v":0},0,0,0,0]
[153,160,{"$f":"BILANCA!D165","v":0},{"$f":"BILANCA!E165","v":0},0,0,0,0]
[154,161,{"$f":"BILANCA!D166","v":0},{"$f":"BILANCA!E166","v":0},0,0,0,0]
[155,162,{"$f":"BILANCA!D167","v":0},{"$f":"BILANCA!E167","v":0},0,0,0,0]
[156,163,{"$f":"BILANCA!D168","v":0},{"$f":"BILANCA!E168","v":0},0,0,0,0]
[157,164,{"$f":"BILANCA!D169","v":0},{"$f":"BILANCA!E169","v":0},0,0,0,0]
[152,165,{"$f":"BILANCA!D170","v":0},{"$f":"BILANCA!E170","v":0},0,0,0,0]
[152,166,{"$f":"BILANCA!D171","v":0},{"$f":"BILANCA!E171","v":0},0,0,0,0]
[152,167,{"$f":"BILANCA!D172","v":0},{"$f":"BILANCA!E172","v":0},0,0,0,0]
[152,168,{"$f":"BILANCA!D173","v":0},{"$f":"BILANCA!E173","v":0},0,0,0,0]
[152,169,{"$f":"BILANCA!D175","v":77393.37},{"$f":"BILANCA!E175","v":73517.420000000013},0,0,37928.367490000004,0.79000000000814907]
[152,170,{"$f":"BILANCA!D176","v":4503.8100000000004},{"$f":"BILANCA!E176","v":5561.88},0,0,2656.6869000000002,0.30999999999949068]
[152,171,{"$f":"BILANCA!D177","v":4503.8100000000004},{"$f":"BILANCA!E177","v":5143.8900000000003},0,0,2529.3618900000001,0.2999999999992724]
[152,172,{"$f":"BILANCA!D178","v":3872.57},{"$f":"BILANCA!E178","v":4499.22},0,0,2213.8137200000001,0.65000000000009095]
[152,173,{"$f":"BILANCA!D179","v":631.24},{"$f":"BILANCA!E179","v":644.66999999999996},0,0,332.26033999999999,0.57000000000005002]
[152,174,{"$f":"BILANCA!D180","v":0},{"$f":"BILANCA!E180","v":0},0,0,0,0]
[152,175,{"$f":"BILANCA!D181","v":0},{"$f":"BILANCA!E181","v":0},0,0,0,0]
[152,176,{"$f":"BILANCA!D182","v":0},{"$f":"BILANCA!E182","v":0},0,0,0,0]
[152,177,{"$f":"BILANCA!D183","v":0},{"$f":"BILANCA!E183","v":0},0,0,0,0]
[152,178,{"$f":"BILANCA!D184","v":0},{"$f":"BILANCA!E184","v":0},0,0,0,0]
[152,179,{"$f":"BILANCA!D185","v":0},{"$f":"BILANCA!E185","v":0},0,0,{"$f":"B1162/1000*C1162+B1162/500*D1162","v":0},{"$f":"ABS(C1162-ROUND(C1162,0))+ABS(D1162-ROUND(D1162,0))","v":0}]
[152,180,{"$f":"BILANCA!D186","v":0},{"$f":"BILANCA!E186","v":0},0,0,0,0]
[152,181,{"$f":"BILANCA!D187","v":0},{"$f":"BILANCA!E187","v":0},0,0,0,0]
[152,182,{"$f":"BILANCA!D188","v":0},{"$f":"BILANCA!E188","v":0},0,0,0,0]
[152,183,{"$f":"BILANCA!D189","v":0},{"$f":"BILANCA!E189","v":417.99},0,0,152.98434,9.9999999999909051E-3]
[152,184,{"$f":"BILANCA!D190","v":0},{"$f":"BILANCA!E190","v":0},0,0,0,0]
[152,185,{"$f":"BILANCA!D191","v":0},{"$f":"BILANCA!E191","v":0},0,0,0,0]
[152,186,{"$f":"BILANCA!D192","v":0},{"$f":"BILANCA!E192","v":0},0,0,0,0]
[152,187,{"$f":"BILANCA!D193","v":0},{"$f":"BILANCA!E193","v":0},0,0,0,0]
[152,188,{"$f":"BILANCA!D194","v":0},{"$f":"BILANCA!E194","v":0},0,0,0,0]
[152,189,{"$f":"BILANCA!D195","v":0},{"$f":"BILANCA!E195","v":0},0,0,0,0]
[152,190,{"$f":"BILANCA!D196","v":0},{"$f":"BILANCA!E196","v":0},0,0,0,0]
[152,191,{"$f":"BILANCA!D197","v":0},{"$f":"BILANCA!E197","v":0},0,0,0,0]
[152,192,{"$f":"BILANCA!D198","v":0},{"$f":"BILANCA!E198","v":0},0,0,0,0]
[152,193,{"$f":"BILANCA!D199","v":0},{"$f":"BILANCA!E199","v":0},0,0,0,0]
[152,194,{"$f":"BILANCA!D200","v":0},{"$f":"BILANCA!E200","v":0},0,0,0,0]
[152,195,{"$f":"BILANCA!D201","v":0},{"$f":"BILANCA!E201","v":0},0,0,0,0]
[152,196,{"$f":"BILANCA!D202","v":0},{"$f":"BILANCA!E202","v":0},0,0,0,0]
[152,197,{"$f":"BILANCA!D203","v":0},{"$f":"BILANCA!E203","v":0},0,0,0,0]
[152,198,{"$f":"BILANCA!D204","v":0},{"$f":"BILANCA!E204","v":0},0,0,0,0]
[152,199,{"$f":"BILANCA!D205","v":0},{"$f":"BILANCA!E205","v":0},0,0,0,0]
[152,200,{"$f":"BILANCA!D206","v":0},{"$f":"BILANCA!E206","v":0},0,0,0,0]
[152,201,{"$f":"BILANCA!D207","v":0},{"$f":"BILANCA!E207","v":0},0,0,0,0]
[152,202,{"$f":"BILANCA!D208","v":0},{"$f":"BILANCA!E208","v":0},0,0,0,0]
[152,203,{"$f":"BILANCA!D209","v":0},{"$f":"BILANCA!E209","v":0},0,0,0,0]
[152,204,{"$f":"BILANCA!D210","v":0},{"$f":"BILANCA!E210","v":0},0,0,0,0]
[152,205,{"$f":"BILANCA!D211","v":0},{"$f":"BILANCA!E211","v":0},0,0,0,0]
[152,206,{"$f":"BILANCA!D212","v":0},{"$f":"BILANCA!E212","v":0},0,0,0,0]
[152,207,{"$f":"BILANCA!D213","v":0},{"$f":"BILANCA!E213","v":0},0,0,0,0]
[152,208,{"$f":"BILANCA!D214","v":0},{"$f":"BILANCA!E214","v":0},0,0,0,0]
[152,209,{"$f":"BILANCA!D215","v":0},{"$f":"BILANCA!E215","v":0},0,0,0,0]
[152,210,{"$f":"BILANCA!D216","v":0},{"$f":"BILANCA!E216","v":0},0,0,0,0]
[152,211,{"$f":"BILANCA!D217","v":0},{"$f":"BILANCA!E217","v":0},0,0,0,0]
[152,212,{"$f":"BILANCA!D218","v":0},{"$f":"BILANCA!E218","v":0},0,0,0,0]
[152,213,{"$f":"BILANCA!D219","v":0},{"$f":"BILANCA!E219","v":0},0,0,0,0]
[152,214,{"$f":"BILANCA!D220","v":0},{"$f":"BILANCA!E220","v":0},0,0,0,0]
[152,215,{"$f":"BILANCA!D221","v":0},{"$f":"BILANCA!E221","v":0},0,0,0,0]
[152,216,{"$f":"BILANCA!D222","v":0},{"$f":"BILANCA!E222","v":0},0,0,0,0]
[152,217,{"$f":"BILANCA!D223","v":0},{"$f":"BILANCA!E223","v":0},0,0,0,0]
[152,218,{"$f":"BILANCA!D224","v":0},{"$f":"BILANCA!E224","v":0},0,0,0,0]
[152,219,{"$f":"BILANCA!D225","v":0},{"$f":"BILANCA!E225","v":0},0,0,0,0]
[152,220,{"$f":"BILANCA!D226","v":0},{"$f":"BILANCA!E226","v":0},0,0,0,0]
[152,221,{"$f":"BILANCA!D227","v":0},{"$f":"BILANCA!E227","v":0},0,0,0,0]
[152,222,{"$f":"BILANCA!D228","v":0},{"$f":"BILANCA!E228","v":0},0,0,0,0]
[152,223,{"$f":"BILANCA!D229","v":0},{"$f":"BILANCA!E229","v":0},0,0,0,0]
[152,224,{"$f":"BILANCA!D230","v":0},{"$f":"BILANCA!E230","v":0},0,0,0,0]
[152,225,{"$f":"BILANCA!D231","v":0},{"$f":"BILANCA!E231","v":0},0,0,0,0]
[152,226,{"$f":"BILANCA!D232","v":0},{"$f":"BILANCA!E232","v":0},0,0,0,0]
[152,227,{"$f":"BILANCA!D233","v":0},{"$f":"BILANCA!E233","v":0},0,0,0,0]
[152,228,{"$f":"BILANCA!D234","v":0},{"$f":"BILANCA!E234","v":0},0,0,0,0]
[152,229,{"$f":"BILANCA!D235","v":0},{"$f":"BILANCA!E235","v":0},0,0,0,0]
[152,230,{"$f":"BILANCA!D236","v":0},{"$f":"BILANCA!E236","v":0},0,0,0,0]
[152,231,{"$f":"BILANCA!D237","v":72889.56},{"$f":"BILANCA!E237","v":67955.540000000008},0,0,48232.947840000008,0.89999999999417923]
[152,232,{"$f":"BILANCA!D238","v":66223.13},{"$f":"BILANCA!E238","v":62411.69},0,0,44322.79032,0.44000000000232831]
[152,233,{"$f":"BILANCA!D239","v":66223.13},{"$f":"BILANCA!E239","v":62411.69},0,0,44513.83683,0.44000000000232831]
[152,234,{"$f":"BILANCA!D240","v":66223.13},{"$f":"BILANCA!E240","v":62411.69},0,0,44704.883340000008,0.44000000000232831]
[152,235,{"$f":"BILANCA!D241","v":0},{"$f":"BILANCA!E241","v":0},0,0,0,0]
[152,236,{"$f":"BILANCA!D242","v":0},{"$f":"BILANCA!E242","v":0},0,0,0,0]
[152,237,{"$f":"BILANCA!D243","v":0},{"$f":"BILANCA!E243","v":0},0,0,0,0]
[152,238,{"$f":"BILANCA!D244","v":0},{"$f":"BILANCA!E244","v":0},0,0,0,0]
[152,239,{"$f":"BILANCA!D245","v":6629.9299999999985},{"$f":"BILANCA!E245","v":5536.5499999999993},0,0,4231.0241699999988,0.52000000000225555]
[152,240,{"$f":"BILANCA!D246","v":18475.689999999999},{"$f":"BILANCA!E246","v":7138.74},0,0,7860.7607999999991,0.57000000000152795]
[152,241,{"$f":"BILANCA!D247","v":18475.689999999999},{"$f":"BILANCA!E247","v":7138.74},0,0,7893.51397,0.57000000000152795]
[152,242,{"$f":"BILANCA!D248","v":0},{"$f":"BILANCA!E248","v":0},0,0,0,0]
[152,243,{"$f":"BILANCA!D249","v":0},{"$f":"BILANCA!E249","v":0},0,0,0,0]
[152,244,{"$f":"BILANCA!D250","v":11845.76},{"$f":"BILANCA!E250","v":1602.19},0,0,3672.23416,0.42999999999983629]
[152,245,{"$f":"BILANCA!D251","v":0},{"$f":"BILANCA!E251","v":0},0,0,0,0]
[152,246,{"$f":"BILANCA!D252","v":11845.76},{"$f":"BILANCA!E252","v":1602.19},0,0,3702.3344399999996,0.42999999999983629]
[152,247,{"$f":"BILANCA!D253","v":0},{"$f":"BILANCA!E253","v":0},0,0,0,0]
[152,248,{"$f":"BILANCA!D254","v":0},{"$f":"BILANCA!E254","v":0},0,0,{"$f":"B1231/1000*C1231+B1231/500*D1231","v":0},{"$f":"ABS(C1231-ROUND(C1231,0))+ABS(D1231-ROUND(D1231,0))","v":0}]
[152,249,{"$f":"BILANCA!D255","v":36.5},{"$f":"BILANCA!E255","v":7.3},0,0,12.7239,0.79999999999999982]
[152,250,{"$f":"BILANCA!D256","v":0},{"$f":"BILANCA!E256","v":0},0,0,0,0]
[152,251,{"$f":"BILANCA!D257","v":0},{"$f":"BILANCA!E257","v":0},0,0,0,0]
[152,252,{"$f":"BILANCA!D258","v":0},{"$f":"BILANCA!E258","v":0},0,0,0,0]
[152,253,{"$f":"BILANCA!D259","v":0},{"$f":"BILANCA!E259","v":0},0,0,0,0]
[152,254,{"$f":"BILANCA!D260","v":0},{"$f":"BILANCA!E260","v":0},0,0,0,0]
[152,255,{"$f":"BILANCA!D262","v":0},{"$f":"BILANCA!E262","v":0},0,0,0,0]
[152,256,{"$f":"BILANCA!D263","v":0},{"$f":"BILANCA!E263","v":0},0,0,0,0]
[152,257,{"$f":"BILANCA!D264","v":36.5},{"$f":"BILANCA!E264","v":7.3},0,0,13.1327,0.79999999999999982]
[152,258,{"$f":"BILANCA!D265","v":11050.77},{"$f":"BILANCA!E265","v":11043.44},0,0,8549.5137000000013,0.67000000000007276]
[152,259,{"$f":"BILANCA!D266","v":0},{"$f":"BILANCA!E266","v":0},0,0,{"$f":"B1242/1000*C1242+B1242/500*D1242","v":0},0]
[152,260,{"$f":"BILANCA!D267","v":0},{"$f":"BILANCA!E267","v":0},0,0,0,0]
[152,261,{"$f":"BILANCA!D268","v":0},{"$f":"BILANCA!E268","v":0},0,0,0,0]
[152,262,{"$f":"BILANCA!D269","v":0},{"$f":"BILANCA!E269","v":0},0,0,0,0]
[152,263,{"$f":"BILANCA!D270","v":0},{"$f":"BILANCA!E270","v":0},0,0,0,0]
[152,264,{"$f":"BILANCA!D271","v":0},{"$f":"BILANCA!E271","v":0},0,0,0,0]
[152,265,{"$f":"BILANCA!D272","v":0},{"$f":"BILANCA!E272","v":0},0,0,0,0]
[152,266,{"$f":"BILANCA!D273","v":0},{"$f":"BILANCA!E273","v":0},0,0,0,0]
[152,267,{"$f":"BILANCA!D274","v":0},{"$f":"BILANCA!E274","v":0},0,0,{"$f":"B1250/1000*C1250+B1250/500*D1250","v":0},{"$f":"ABS(C1250-ROUND(C1250,0))+ABS(D1250-ROUND(D1250,0))","v":0}]
[152,268,{"$f":"BILANCA!D275","v":0},{"$f":"BILANCA!E275","v":0},0,0,0,0]
[152,269,{"$f":"BILANCA!D276","v":0},{"$f":"BILANCA!E276","v":0},0,0,0,0]
[152,270,{"$f":"BILANCA!D277","v":0},{"$f":"BILANCA!E277","v":0},0,0,0,0]
[152,271,{"$f":"BILANCA!D278","v":0},{"$f":"BILANCA!E278","v":0},0,0,0,0]
[152,272,{"$f":"BILANCA!D279","v":0},{"$f":"BILANCA!E279","v":0},0,0,0,0]
[152,273,{"$f":"BILANCA!D280","v":0},{"$f":"BILANCA!E280","v":0},0,0,0,0]
[152,274,{"$f":"BILANCA!D281","v":0},{"$f":"BILANCA!E281","v":0},0,0,0,0]
[152,275,{"$f":"BILANCA!D282","v":0},{"$f":"BILANCA!E282","v":0},0,0,0,0]
[152,276,{"$f":"BILANCA!D283","v":0},{"$f":"BILANCA!E283","v":0},0,0,0,0]
[152,277,{"$f":"BILANCA!D284","v":0},{"$f":"BILANCA!E284","v":0},0,0,0,0]
[152,278,{"$f":"BILANCA!D285","v":0},{"$f":"BILANCA!E285","v":0},0,0,0,0]
[152,279,{"$f":"BILANCA!D286","v":11050.77},{"$f":"BILANCA!E286","v":11043.44},0,0,9245.4043500000007,0.67000000000007276]
[152,280,{"$f":"BILANCA!D287","v":0},{"$f":"BILANCA!E287","v":0},0,0,0,0]
[152,281,{"$f":"BILANCA!D288","v":4503.8100000000004},{"$f":"BILANCA!E288","v":5143.8900000000003},0,0,4156.4367900000007,0.2999999999992724]
[152,282,{"$f":"BILANCA!D289","v":0},{"$f":"BILANCA!E289","v":0},0,0,0,0]
[152,283,{"$f":"BILANCA!D290","v":0},{"$f":"BILANCA!E290","v":417.99},0,0,236.58233999999999,9.9999999999909051E-3]
[152,284,{"$f":"BILANCA!D291","v":0},{"$f":"BILANCA!E291","v":0},0,0,0,0]
[152,285,{"$f":"BILANCA!D292","v":0},{"$f":"BILANCA!E292","v":0},0,0,0,0]
[152,286,{"$f":"BILANCA!D293","v":0},{"$f":"BILANCA!E293","v":0},0,0,0,0]
[152,287,{"$f":"BILANCA!D294","v":0},{"$f":"BILANCA!E294","v":0},0,0,0,0]
[152,288,{"$f":"BILANCA!D295","v":0},{"$f":"BILANCA!E295","v":0},0,0,0,0]
[152,289,{"$f":"BILANCA!D296","v":0},{"$f":"BILANCA!E296","v":0},0,0,0,0]
[152,290,{"$f":"BILANCA!D297","v":0},{"$f":"BILANCA!E297","v":0},0,0,0,0]
[152,291,{"$f":"BILANCA!D298","v":0},{"$f":"BILANCA!E298","v":0},0,0,0,0]
[152,292,{"$f":"BILANCA!D299","v":0},{"$f":"BILANCA!E299","v":0},0,0,0,0]
[152,293,{"$f":"BILANCA!D300","v":0},{"$f":"BILANCA!E300","v":0},0,0,0,0]
[152,294,{"$f":"BILANCA!D301","v":0},{"$f":"BILANCA!E301","v":0},0,0,0,0]
[152,295,{"$f":"BILANCA!D302","v":0},{"$f":"BILANCA!E302","v":0},0,0,0,0]
[152,296,{"$f":"BILANCA!D303","v":0},{"$f":"BILANCA!E303","v":0},0,0,0,0]
[152,297,{"$f":"BILANCA!D304","v":0},{"$f":"BILANCA!E304","v":0},0,0,0,0]
[152,298,{"$f":"BILANCA!D305","v":0},{"$f":"BILANCA!E305","v":0},0,0,0,0]
[152,299,{"$f":"BILANCA!D306","v":0},{"$f":"BILANCA!E306","v":0},0,0,0,0]
[152,300,{"$f":"BILANCA!D307","v":0},{"$f":"BILANCA!E307","v":0},0,0,0,0]
[152,301,{"$f":"BILANCA!D308","v":0},{"$f":"BILANCA!E308","v":0},0,0,0,0]
[152,302,{"$f":"BILANCA!D309","v":0},{"$f":"BILANCA!E309","v":0},0,0,0,0]
[152,303,{"$f":"BILANCA!D310","v":0},{"$f":"BILANCA!E310","v":0},0,0,0,0]
[152,304,{"$f":"BILANCA!D311","v":0},{"$f":"BILANCA!E311","v":0},0,0,0,0]
[152,305,{"$f":"BILANCA!D312","v":0},{"$f":"BILANCA!E312","v":0},0,0,0,0]
[152,306,{"$f":"BILANCA!D313","v":0},{"$f":"BILANCA!E313","v":0},0,0,0,0]
[152,307,{"$f":"BILANCA!D314","v":0},{"$f":"BILANCA!E314","v":0},0,0,0,0]
[152,308,{"$f":"BILANCA!D315","v":0},{"$f":"BILANCA!E315","v":0},0,0,0,0]
[152,309,{"$f":"BILANCA!D316","v":0},{"$f":"BILANCA!E316","v":0},0,0,0,0]
[152,310,{"$f":"BILANCA!D317","v":0},{"$f":"BILANCA!E317","v":0},0,0,0,0]
[152,311,{"$f":"BILANCA!D318","v":0},{"$f":"BILANCA!E318","v":0},0,0,0,0]
[152,312,{"$f":"BILANCA!D319","v":0},{"$f":"BILANCA!E319","v":0},0,0,0,0]
[152,313,{"$f":"BILANCA!D320","v":0},{"$f":"BILANCA!E320","v":0},0,0,0,0]
[152,314,{"$f":"BILANCA!D321","v":0},{"$f":"BILANCA!E321","v":0},0,0,0,0]
[152,315,{"$f":"BILANCA!D322","v":0},{"$f":"BILANCA!E322","v":0},0,0,0,0]
[154,1,{"$f":"'RAS-funkcijski'!D5","v":0},{"$f":"'RAS-funkcijski'!E5","v":0},0,0,0,0]
[154,2,{"$f":"'RAS-funkcijski'!D6","v":0},{"$f":"'RAS-funkcijski'!E6","v":0},0,0,0,0]
[154,3,{"$f":"'RAS-funkcijski'!D7","v":0},{"$f":"'RAS-funkcijski'!E7","v":0},0,0,0,0]
[154,4,{"$f":"'RAS-funkcijski'!D8","v":0},{"$f":"'RAS-funkcijski'!E8","v":0},0,0,0,0]
[154,5,{"$f":"'RAS-funkcijski'!D9","v":0},{"$f":"'RAS-funkcijski'!E9","v":0},0,0,0,0]
[154,6,{"$f":"'RAS-funkcijski'!D10","v":0},{"$f":"'RAS-funkcijski'!E10","v":0},0,0,0,0]
[154,7,{"$f":"'RAS-funkcijski'!D11","v":0},{"$f":"'RAS-funkcijski'!E11","v":0},0,0,0,0]
[154,8,{"$f":"'RAS-funkcijski'!D12","v":0},{"$f":"'RAS-funkcijski'!E12","v":0},0,0,0,0]
[154,9,{"$f":"'RAS-funkcijski'!D13","v":0},{"$f":"'RAS-funkcijski'!E13","v":0},0,0,0,0]
[154,10,{"$f":"'RAS-funkcijski'!D14","v":0},{"$f":"'RAS-funkcijski'!E14","v":0},0,0,0,0]
[154,11,{"$f":"'RAS-funkcijski'!D15","v":0},{"$f":"'RAS-funkcijski'!E15","v":0},0,0,0,0]
[154,12,{"$f":"'RAS-funkcijski'!D16","v":0},{"$f":"'RAS-funkcijski'!E16","v":0},0,0,0,0]
[154,13,{"$f":"'RAS-funkcijski'!D17","v":0},{"$f":"'RAS-funkcijski'!E17","v":0},0,0,0,0]
[154,14,{"$f":"'RAS-funkcijski'!D18","v":0},{"$f":"'RAS-funkcijski'!E18","v":0},0,0,0,0]
[154,15,{"$f":"'RAS-funkcijski'!D19","v":0},{"$f":"'RAS-funkcijski'!E19","v":0},0,0,0,0]
[154,16,{"$f":"'RAS-funkcijski'!D20","v":0},{"$f":"'RAS-funkcijski'!E20","v":0},0,0,0,0]
[154,17,{"$f":"'RAS-funkcijski'!D21","v":0},{"$f":"'RAS-funkcijski'!E21","v":0},0,0,0,0]
[154,18,{"$f":"'RAS-funkcijski'!D22","v":0},{"$f":"'RAS-funkcijski'!E22","v":0},0,0,0,0]
[154,19,{"$f":"'RAS-funkcijski'!D23","v":0},{"$f":"'RAS-funkcijski'!E23","v":0},0,0,0,0]
[154,20,{"$f":"'RAS-funkcijski'!D24","v":0},{"$f":"'RAS-funkcijski'!E24","v":0},0,0,0,0]
[154,21,{"$f":"'RAS-funkcijski'!D25","v":0},{"$f":"'RAS-funkcijski'!E25","v":0},0,0,0,0]
[154,22,{"$f":"'RAS-funkcijski'!D26","v":0},{"$f":"'RAS-funkcijski'!E26","v":0},0,0,0,0]
[154,23,{"$f":"'RAS-funkcijski'!D27","v":0},{"$f":"'RAS-funkcijski'!E27","v":0},0,0,0,0]
[154,24,{"$f":"'RAS-funkcijski'!D28","v":0},{"$f":"'RAS-funkcijski'!E28","v":0},0,0,0,0]
[154,25,{"$f":"'RAS-funkcijski'!D29","v":0},{"$f":"'RAS-funkcijski'!E29","v":0},0,0,0,0]
[154,26,{"$f":"'RAS-funkcijski'!D30","v":0},{"$f":"'RAS-funkcijski'!E30","v":0},0,0,0,0]
[154,27,{"$f":"'RAS-funkcijski'!D31","v":0},{"$f":"'RAS-funkcijski'!E31","v":0},0,0,0,0]
[154,28,{"$f":"'RAS-funkcijski'!D32","v":0},{"$f":"'RAS-funkcijski'!E32","v":0},0,0,0,0]
[154,29,{"$f":"'RAS-funkcijski'!D33","v":0},{"$f":"'RAS-funkcijski'!E33","v":0},0,0,0,0]
[154,30,{"$f":"'RAS-funkcijski'!D34","v":0},{"$f":"'RAS-funkcijski'!E34","v":0},0,0,0,0]
[154,31,{"$f":"'RAS-funkcijski'!D35","v":0},{"$f":"'RAS-funkcijski'!E35","v":0},0,0,0,0]
[154,32,{"$f":"'RAS-funkcijski'!D36","v":0},{"$f":"'RAS-funkcijski'!E36","v":0},0,0,0,0]
[154,33,{"$f":"'RAS-funkcijski'!D37","v":0},{"$f":"'RAS-funkcijski'!E37","v":0},0,0,0,0]
[154,34,{"$f":"'RAS-funkcijski'!D38","v":0},{"$f":"'RAS-funkcijski'!E38","v":0},0,0,0,0]
[154,35,{"$f":"'RAS-funkcijski'!D39","v":0},{"$f":"'RAS-funkcijski'!E39","v":0},0,0,0,0]
[154,36,{"$f":"'RAS-funkcijski'!D40","v":0},{"$f":"'RAS-funkcijski'!E40","v":0},0,0,0,0]
[154,37,{"$f":"'RAS-funkcijski'!D41","v":0},{"$f":"'RAS-funkcijski'!E41","v":0},0,0,0,0]
[154,38,{"$f":"'RAS-funkcijski'!D42","v":0},{"$f":"'RAS-funkcijski'!E42","v":0},0,0,0,0]
[154,39,{"$f":"'RAS-funkcijski'!D43","v":0},{"$f":"'RAS-funkcijski'!E43","v":0},0,0,0,0]
[154,40,{"$f":"'RAS-funkcijski'!D44","v":0},{"$f":"'RAS-funkcijski'!E44","v":0},0,0,0,{"$f":"ABS(C1338-ROUND(C1338,0))+ABS(D1338-ROUND(D1338,0))","v":0}]
[154,41,{"$f":"'RAS-funkcijski'!D45","v":0},{"$f":"'RAS-funkcijski'!E45","v":0},0,0,0,0]
[154,42,{"$f":"'RAS-funkcijski'!D46","v":0},{"$f":"'RAS-funkcijski'!E46","v":0},0,0,0,0]
[154,43,{"$f":"'RAS-funkcijski'!D47","v":0},{"$f":"'RAS-funkcijski'!E47","v":0},0,0,0,0]
[154,44,{"$f":"'RAS-funkcijski'!D48","v":0},{"$f":"'RAS-funkcijski'!E48","v":0},0,0,0,0]
[154,45,{"$f":"'RAS-funkcijski'!D49","v":0},{"$f":"'RAS-funkcijski'!E49","v":0},0,0,0,0]
[154,46,{"$f":"'RAS-funkcijski'!D50","v":0},{"$f":"'RAS-funkcijski'!E50","v":0},0,0,0,0]
[154,47,{"$f":"'RAS-funkcijski'!D51","v":0},{"$f":"'RAS-funkcijski'!E51","v":0},0,0,0,0]
[154,48,{"$f":"'RAS-funkcijski'!D52","v":0},{"$f":"'RAS-funkcijski'!E52","v":0},0,0,0,0]
[154,49,{"$f":"'RAS-funkcijski'!D53","v":0},{"$f":"'RAS-funkcijski'!E53","v":0},0,0,0,0]
[154,50,{"$f":"'RAS-funkcijski'!D54","v":0},{"$f":"'RAS-funkcijski'!E54","v":0},0,0,0,0]
[154,51,{"$f":"'RAS-funkcijski'!D55","v":0},{"$f":"'RAS-funkcijski'!E55","v":0},0,0,0,0]
[154,52,{"$f":"'RAS-funkcijski'!D56","v":0},{"$f":"'RAS-funkcijski'!E56","v":0},0,0,0,0]
[154,53,{"$f":"'RAS-funkcijski'!D57","v":0},{"$f":"'RAS-funkcijski'!E57","v":0},0,0,0,0]
[154,54,{"$f":"'RAS-funkcijski'!D58","v":0},{"$f":"'RAS-funkcijski'!E58","v":0},0,0,0,0]
[154,55,{"$f":"'RAS-funkcijski'!D59","v":0},{"$f":"'RAS-funkcijski'!E59","v":0},0,0,0,0]
[154,56,{"$f":"'RAS-funkcijski'!D60","v":0},{"$f":"'RAS-funkcijski'!E60","v":0},0,0,0,0]
[154,57,{"$f":"'RAS-funkcijski'!D61","v":0},{"$f":"'RAS-funkcijski'!E61","v":0},0,0,0,0]
[154,58,{"$f":"'RAS-funkcijski'!D62","v":0},{"$f":"'RAS-funkcijski'!E62","v":0},0,0,0,0]
[154,59,{"$f":"'RAS-funkcijski'!D63","v":0},{"$f":"'RAS-funkcijski'!E63","v":0},0,0,0,0]
[154,60,{"$f":"'RAS-funkcijski'!D64","v":0},{"$f":"'RAS-funkcijski'!E64","v":0},0,0,0,0]
[154,61,{"$f":"'RAS-funkcijski'!D65","v":0},{"$f":"'RAS-funkcijski'!E65","v":0},0,0,0,0]
[154,62,{"$f":"'RAS-funkcijski'!D66","v":0},{"$f":"'RAS-funkcijski'!E66","v":0},0,0,0,0]
[154,63,{"$f":"'RAS-funkcijski'!D67","v":0},{"$f":"'RAS-funkcijski'!E67","v":0},0,0,0,0]
[154,64,{"$f":"'RAS-funkcijski'!D68","v":0},{"$f":"'RAS-funkcijski'!E68","v":0},0,0,0,0]
[154,65,{"$f":"'RAS-funkcijski'!D69","v":0},{"$f":"'RAS-funkcijski'!E69","v":0},0,0,0,0]
[154,66,{"$f":"'RAS-funkcijski'!D70","v":0},{"$f":"'RAS-funkcijski'!E70","v":0},0,0,0,0]
[154,67,{"$f":"'RAS-funkcijski'!D71","v":0},{"$f":"'RAS-funkcijski'!E71","v":0},0,0,0,0]
[154,68,{"$f":"'RAS-funkcijski'!D72","v":0},{"$f":"'RAS-funkcijski'!E72","v":0},0,0,0,0]
[154,69,{"$f":"'RAS-funkcijski'!D73","v":0},{"$f":"'RAS-funkcijski'!E73","v":0},0,0,0,0]
[154,70,{"$f":"'RAS-funkcijski'!D74","v":0},{"$f":"'RAS-funkcijski'!E74","v":0},0,0,0,0]
[154,71,{"$f":"'RAS-funkcijski'!D75","v":0},{"$f":"'RAS-funkcijski'!E75","v":0},0,0,0,0]
[154,72,{"$f":"'RAS-funkcijski'!D76","v":0},{"$f":"'RAS-funkcijski'!E76","v":0},0,0,0,0]
[154,73,{"$f":"'RAS-funkcijski'!D77","v":0},{"$f":"'RAS-funkcijski'!E77","v":0},0,0,0,0]
[154,74,{"$f":"'RAS-funkcijski'!D78","v":0},{"$f":"'RAS-funkcijski'!E78","v":0},0,0,0,0]
[154,75,{"$f":"'RAS-funkcijski'!D79","v":0},{"$f":"'RAS-funkcijski'!E79","v":0},0,0,0,0]
[154,76,{"$f":"'RAS-funkcijski'!D80","v":0},{"$f":"'RAS-funkcijski'!E80","v":0},0,0,0,0]
[154,77,{"$f":"'RAS-funkcijski'!D81","v":0},{"$f":"'RAS-funkcijski'!E81","v":0},0,0,0,0]
[154,78,{"$f":"'RAS-funkcijski'!D82","v":0},{"$f":"'RAS-funkcijski'!E82","v":0},0,0,0,0]
[154,79,{"$f":"'RAS-funkcijski'!D83","v":0},{"$f":"'RAS-funkcijski'!E83","v":0},0,0,0,0]
[154,80,{"$f":"'RAS-funkcijski'!D84","v":0},{"$f":"'RAS-funkcijski'!E84","v":0},0,0,0,0]
[154,81,{"$f":"'RAS-funkcijski'!D85","v":0},{"$f":"'RAS-funkcijski'!E85","v":0},0,0,0,0]
[154,82,{"$f":"'RAS-funkcijski'!D86","v":0},{"$f":"'RAS-funkcijski'!E86","v":0},0,0,0,0]
[154,83,{"$f":"'RAS-funkcijski'!D87","v":0},{"$f":"'RAS-funkcijski'!E87","v":0},0,0,0,0]
[154,84,{"$f":"'RAS-funkcijski'!D88","v":0},{"$f":"'RAS-funkcijski'!E88","v":0},0,0,0,0]
[154,85,{"$f":"'RAS-funkcijski'!D89","v":0},{"$f":"'RAS-funkcijski'!E89","v":0},0,0,0,0]
[154,86,{"$f":"'RAS-funkcijski'!D90","v":0},{"$f":"'RAS-funkcijski'!E90","v":0},0,0,0,0]
[154,87,{"$f":"'RAS-funkcijski'!D91","v":0},{"$f":"'RAS-funkcijski'!E91","v":0},0,0,0,0]
[154,88,{"$f":"'RAS-funkcijski'!D92","v":0},{"$f":"'RAS-funkcijski'!E92","v":0},0,0,0,0]
[154,89,{"$f":"'RAS-funkcijski'!D93","v":0},{"$f":"'RAS-funkcijski'!E93","v":0},0,0,0,0]
[154,90,{"$f":"'RAS-funkcijski'!D94","v":0},{"$f":"'RAS-funkcijski'!E94","v":0},0,0,0,0]
[154,91,{"$f":"'RAS-funkcijski'!D95","v":0},{"$f":"'RAS-funkcijski'!E95","v":0},0,0,0,0]
[154,92,{"$f":"'RAS-funkcijski'!D96","v":0},{"$f":"'RAS-funkcijski'!E96","v":0},0,0,0,0]
[154,93,{"$f":"'RAS-funkcijski'!D97","v":0},{"$f":"'RAS-funkcijski'!E97","v":0},0,0,0,0]
[154,94,{"$f":"'RAS-funkcijski'!D98","v":0},{"$f":"'RAS-funkcijski'!E98","v":0},0,0,0,0]
[154,95,{"$f":"'RAS-funkcijski'!D99","v":0},{"$f":"'RAS-funkcijski'!E99","v":0},0,0,0,0]
[154,96,{"$f":"'RAS-funkcijski'!D100","v":0},{"$f":"'RAS-funkcijski'!E100","v":0},0,0,0,0]
[154,97,{"$f":"'RAS-funkcijski'!D101","v":0},{"$f":"'RAS-funkcijski'!E101","v":0},0,0,0,0]
[154,98,{"$f":"'RAS-funkcijski'!D102","v":0},{"$f":"'RAS-funkcijski'!E102","v":0},0,0,0,0]
[154,99,{"$f":"'RAS-funkcijski'!D103","v":0},{"$f":"'RAS-funkcijski'!E103","v":0},0,0,0,0]
[154,100,{"$f":"'RAS-funkcijski'!D104","v":0},{"$f":"'RAS-funkcijski'!E104","v":0},0,0,0,0]
[154,101,{"$f":"'RAS-funkcijski'!D105","v":0},{"$f":"'RAS-funkcijski'!E105","v":0},0,0,0,0]
[154,102,{"$f":"'RAS-funkcijski'!D106","v":0},{"$f":"'RAS-funkcijski'!E106","v":0},0,0,0,0]
[154,103,{"$f":"'RAS-funkcijski'!D107","v":94377.54},{"$f":"'RAS-funkcijski'!E107","v":113277.49},0,0,33056.049559999999,0.95000000001164153]
[154,104,{"$f":"'RAS-funkcijski'!D108","v":0},{"$f":"'RAS-funkcijski'!E108","v":0},0,0,0,0]
[154,105,{"$f":"'RAS-funkcijski'!D109","v":94377.54},{"$f":"'RAS-funkcijski'!E109","v":113277.49},0,0,33697.914599999996,0.95000000001164153]
[154,106,{"$f":"'RAS-funkcijski'!D110","v":0},{"$f":"'RAS-funkcijski'!E110","v":0},0,0,0,0]
[154,107,{"$f":"'RAS-funkcijski'!D111","v":0},{"$f":"'RAS-funkcijski'!E111","v":0},0,0,0,0]
[154,108,{"$f":"'RAS-funkcijski'!D112","v":0},{"$f":"'RAS-funkcijski'!E112","v":0},0,0,0,0]
[154,109,{"$f":"'RAS-funkcijski'!D113","v":0},{"$f":"'RAS-funkcijski'!E113","v":0},0,0,0,0]
[154,110,{"$f":"'RAS-funkcijski'!D114","v":0},{"$f":"'RAS-funkcijski'!E114","v":0},0,0,0,0]
[154,111,{"$f":"'RAS-funkcijski'!D115","v":0},{"$f":"'RAS-funkcijski'!E115","v":0},0,0,0,0]
[154,112,{"$f":"'RAS-funkcijski'!D116","v":0},{"$f":"'RAS-funkcijski'!E116","v":0},0,0,0,0]
[154,113,{"$f":"'RAS-funkcijski'!D117","v":0},{"$f":"'RAS-funkcijski'!E117","v":0},0,0,0,0]
[154,114,{"$f":"'RAS-funkcijski'!D118","v":0},{"$f":"'RAS-funkcijski'!E118","v":0},0,0,0,0]
[154,115,{"$f":"'RAS-funkcijski'!D119","v":0},{"$f":"'RAS-funkcijski'!E119","v":0},0,0,0,0]
[154,116,{"$f":"'RAS-funkcijski'!D120","v":0},{"$f":"'RAS-funkcijski'!E120","v":0},0,0,0,0]
[154,117,{"$f":"'RAS-funkcijski'!D121","v":0},{"$f":"'RAS-funkcijski'!E121","v":0},0,0,0,0]
[154,118,{"$f":"'RAS-funkcijski'!D122","v":0},{"$f":"'RAS-funkcijski'!E122","v":0},0,0,0,0]
[154,119,{"$f":"'RAS-funkcijski'!D123","v":0},{"$f":"'RAS-funkcijski'!E123","v":0},0,0,0,0]
[154,120,{"$f":"'RAS-funkcijski'!D124","v":0},{"$f":"'RAS-funkcijski'!E124","v":0},0,0,0,0]
[154,121,{"$f":"'RAS-funkcijski'!D125","v":0},{"$f":"'RAS-funkcijski'!E125","v":0},0,0,0,0]
[154,122,{"$f":"'RAS-funkcijski'!D126","v":0},{"$f":"'RAS-funkcijski'!E126","v":0},0,0,0,0]
[154,123,{"$f":"'RAS-funkcijski'!D127","v":0},{"$f":"'RAS-funkcijski'!E127","v":0},0,0,0,0]
[154,124,{"$f":"'RAS-funkcijski'!D128","v":0},{"$f":"'RAS-funkcijski'!E128","v":0},0,0,0,0]
[154,125,{"$f":"'RAS-funkcijski'!D129","v":0},{"$f":"'RAS-funkcijski'!E129","v":0},0,0,0,0]
[154,126,{"$f":"'RAS-funkcijski'!D130","v":0},{"$f":"'RAS-funkcijski'!E130","v":0},0,0,0,0]
[154,127,{"$f":"'RAS-funkcijski'!D131","v":0},{"$f":"'RAS-funkcijski'!E131","v":0},0,0,0,0]
[154,128,{"$f":"'RAS-funkcijski'!D132","v":0},{"$f":"'RAS-funkcijski'!E132","v":0},0,0,0,0]
[154,129,{"$f":"'RAS-funkcijski'!D133","v":0},{"$f":"'RAS-funkcijski'!E133","v":0},0,0,0,0]
[154,130,{"$f":"'RAS-funkcijski'!D134","v":0},{"$f":"'RAS-funkcijski'!E134","v":0},0,0,0,0]
[154,131,{"$f":"'RAS-funkcijski'!D135","v":0},{"$f":"'RAS-funkcijski'!E135","v":0},0,0,0,0]
[154,132,{"$f":"'RAS-funkcijski'!D136","v":0},{"$f":"'RAS-funkcijski'!E136","v":0},0,0,0,0]
[154,133,{"$f":"'RAS-funkcijski'!D137","v":0},{"$f":"'RAS-funkcijski'!E137","v":0},0,0,0,0]
[154,134,{"$f":"'RAS-funkcijski'!D138","v":0},{"$f":"'RAS-funkcijski'!E138","v":0},0,0,0,0]
[154,135,{"$f":"'RAS-funkcijski'!D139","v":0},{"$f":"'RAS-funkcijski'!E139","v":0},0,0,0,0]
[154,136,{"$f":"'RAS-funkcijski'!D140","v":0},{"$f":"'RAS-funkcijski'!E140","v":0},0,0,0,0]
[154,137,{"$f":"'RAS-funkcijski'!D141","v":94377.54},{"$f":"'RAS-funkcijski'!E141","v":113277.49},0,0,43967.755240000006,0.95000000001164153]
[156,1,{"$f":"'P-VRIO'!D5","v":6840.64},{"$f":"'P-VRIO'!E5","v":3347.3},0,0,13.535240000000002,0.65999999999985448,0]
[156,2,{"$f":"'P-VRIO'!D6","v":0},{"$f":"'P-VRIO'!E6","v":3305.61},0,0,13.222440000000001,0.38999999999987267,0]
[156,3,{"$f":"'P-VRIO'!D7","v":0},{"$f":"'P-VRIO'!E7","v":3305.61},0,0,19.833660000000002,0.38999999999987267,0]
[156,4,{"$f":"'P-VRIO'!D8","v":0},{"$f":"'P-VRIO'!E8","v":3305.61},0,0,26.444880000000001,0.38999999999987267,{"$f":"G1439*H1439","v":10.313503199996633},{"$f":"IF(AND(Skriveni!C1439<>0,Skriveni!D1439<>0),1,0)","v":0}]
[156,5,{"$f":"'P-VRIO'!D9","v":0},{"$f":"'P-VRIO'!E9","v":0},0,0,0,0,0,{"$f":"IF(AND(Skriveni!C1440<>0,Skriveni!D1440<>0),1,0)","v":0}]
[156,6,{"$f":"'P-VRIO'!D10","v":0},{"$f":"'P-VRIO'!E10","v":0},0,0,0,0,0,{"$f":"IF(AND(Skriveni!C1441<>0,Skriveni!D1441<>0),1,0)","v":0}]
[156,7,{"$f":"'P-VRIO'!D11","v":0},{"$f":"'P-VRIO'!E11","v":0},0,0,0,0,0,{"$f":"IF(AND(Skriveni!C1442<>0,Skriveni!D1442<>0),1,0)","v":0}]
[156,8,{"$f":"'P-VRIO'!D12","v":0},{"$f":"'P-VRIO'!E12","v":0},0,0,0,0,0,{"$f":"IF(AND(Skriveni!C1443<>0,Skriveni!D1443<>0),1,0)","v":0}]
[156,9,{"$f":"'P-VRIO'!D13","v":0},{"$f":"'P-VRIO'!E13","v":0},0,0,0,0,0,{"$f":"IF(AND(Skriveni!C1444<>0,Skriveni!D1444<>0),1,0)","v":0}]
[156,10,{"$f":"'P-VRIO'!D14","v":0},{"$f":"'P-VRIO'!E14","v":0},0,0,0,0,0,{"$f":"IF(AND(Skriveni!C1445<>0,Skriveni!D1445<>0),1,0)","v":0}]
[156,11,{"$f":"'P-VRIO'!D15","v":0},{"$f":"'P-VRIO'!E15","v":0},0,0,0,0,{"$f":"G1446*H1446","v":0},{"$f":"IF(AND(Skriveni!C1446<>0,Skriveni!D1446<>0),1,0)","v":0}]
[156,12,{"$f":"'P-VRIO'!D16","v":0},{"$f":"'P-VRIO'!E16","v":0},0,0,0,0,0,{"$f":"IF(AND(Skriveni!C1447<>0,Skriveni!D1447<>0),1,0)","v":0}]
[156,13,{"$f":"'P-VRIO'!D17","v":0},{"$f":"'P-VRIO'!E17","v":0},0,0,0,0,0,{"$f":"IF(AND(Skriveni!C1448<>0,Skriveni!D1448<>0),1,0)","v":0}]
[156,14,{"$f":"'P-VRIO'!D18","v":0},{"$f":"'P-VRIO'!E18","v":0},0,0,0,0,0,{"$f":"IF(AND(Skriveni!C1449<>0,Skriveni!D1449<>0),1,0)","v":0}]
[156,15,{"$f":"'P-VRIO'!D19","v":0},{"$f":"'P-VRIO'!E19","v":0},0,0,0,0,0,{"$f":"IF(AND(Skriveni!C1450<>0,Skriveni!D1450<>0),1,0)","v":0}]
[156,16,{"$f":"'P-VRIO'!D20","v":0},{"$f":"'P-VRIO'!E20","v":0},0,0,0,0,0,{"$f":"IF(AND(Skriveni!C1451<>0,Skriveni!D1451<>0),1,0)","v":0}]
[156,17,{"$f":"'P-VRIO'!D21","v":0},{"$f":"'P-VRIO'!E21","v":0},0,0,0,0,0,{"$f":"IF(AND(Skriveni!C1452<>0,Skriveni!D1452<>0),1,0)","v":0}]
[156,18,{"$f":"'P-VRIO'!D22","v":6840.64},{"$f":"'P-VRIO'!E22","v":41.69},0,0,124.63235999999999,0.66999999999967486,0]
[156,19,{"$f":"'P-VRIO'!D23","v":6840.64},{"$f":"'P-VRIO'!E23","v":41.69},0,0,131.55637999999999,0.66999999999967486,0]
[156,20,{"$f":"'P-VRIO'!D24","v":0},{"$f":"'P-VRIO'!E24","v":0},0,0,0,0,{"$f":"G1455*H1455","v":0},{"$f":"IF(AND(Skriveni!C1455<>0,Skriveni!D1455<>0),1,0)","v":0}]
[156,21,{"$f":"'P-VRIO'!D25","v":6840.64},{"$f":"'P-VRIO'!E25","v":41.69},0,0,145.40442000000002,0.66999999999967486,97.420961399952731,{"$f":"IF(AND(Skriveni!C1456<>0,Skriveni!D1456<>0),1,0)","v":1}]
[156,22,{"$f":"'P-VRIO'!D26","v":0},{"$f":"'P-VRIO'!E26","v":0},0,0,0,0,0,{"$f":"IF(AND(Skriveni!C1457<>0,Skriveni!D1457<>0),1,0)","v":0}]
[156,23,{"$f":"'P-VRIO'!D27","v":0},{"$f":"'P-VRIO'!E27","v":0},0,0,0,0,0,{"$f":"IF(AND(Skriveni!C1458<>0,Skriveni!D1458<>0),1,0)","v":0}]
[156,24,{"$f":"'P-VRIO'!D28","v":0},{"$f":"'P-VRIO'!E28","v":0},0,0,0,0,0,{"$f":"IF(AND(Skriveni!C1459<>0,Skriveni!D1459<>0),1,0)","v":0}]
[156,25,{"$f":"'P-VRIO'!D29","v":0},{"$f":"'P-VRIO'!E29","v":0},0,0,0,0,0,{"$f":"IF(AND(Skriveni!C1460<>0,Skriveni!D1460<>0),1,0)","v":0}]
[156,26,{"$f":"'P-VRIO'!D30","v":0},{"$f":"'P-VRIO'!E30","v":0},0,0,0,0,0]
[156,27,{"$f":"'P-VRIO'!D31","v":0},{"$f":"'P-VRIO'!E31","v":0},0,0,0,0,{"$f":"G1462*H1462","v":0},{"$f":"IF(AND(Skriveni!C1462<>0,Skriveni!D1462<>0),1,0)","v":0}]
[156,28,{"$f":"'P-VRIO'!D32","v":0},{"$f":"'P-VRIO'!E32","v":0},0,0,0,0,0,{"$f":"IF(AND(Skriveni!C1463<>0,Skriveni!D1463<>0),1,0)","v":0}]
[156,29,{"$f":"'P-VRIO'!D33","v":0},{"$f":"'P-VRIO'!E33","v":0},0,0,0,0,0,{"$f":"IF(AND(Skriveni!C1464<>0,Skriveni!D1464<>0),1,0)","v":0}]
[156,30,{"$f":"'P-VRIO'!D34","v":0},{"$f":"'P-VRIO'!E34","v":0},0,0,0,0,0,{"$f":"IF(AND(Skriveni!C1465<>0,Skriveni!D1465<>0),1,0)","v":0}]
[156,31,{"$f":"'P-VRIO'!D35","v":0},{"$f":"'P-VRIO'!E35","v":0},0,0,0,0,0,{"$f":"IF(AND(Skriveni!C1466<>0,Skriveni!D1466<>0),1,0)","v":0}]
[156,32,{"$f":"'P-VRIO'!D36","v":0},{"$f":"'P-VRIO'!E36","v":0},0,0,0,0,0,{"$f":"IF(AND(Skriveni!C1467<>0,Skriveni!D1467<>0),1,0)","v":0}]
[156,33,{"$f":"'P-VRIO'!D37","v":0},{"$f":"'P-VRIO'!E37","v":0},0,0,0,0,0,{"$f":"IF(AND(Skriveni!C1468<>0,Skriveni!D1468<>0),1,0)","v":0}]
[156,34,{"$f":"'P-VRIO'!D38","v":0},{"$f":"'P-VRIO'!E38","v":0},0,0,0,0,0]
[156,35,{"$f":"'P-VRIO'!D39","v":0},{"$f":"'P-VRIO'!E39","v":0},0,0,0,0,0]
[156,36,{"$f":"'P-VRIO'!D40","v":0},{"$f":"'P-VRIO'!E40","v":0},0,0,0,0,{"$f":"G1471*H1471","v":0},{"$f":"IF(AND(Skriveni!C1471<>0,Skriveni!D1471<>0),1,0)","v":0}]
[156,37,{"$f":"'P-VRIO'!D41","v":0},{"$f":"'P-VRIO'!E41","v":0},0,0,0,0,0,{"$f":"IF(AND(Skriveni!C1472<>0,Skriveni!D1472<>0),1,0)","v":0}]
[156,38,{"$f":"'P-VRIO'!D42","v":0},{"$f":"'P-VRIO'!E42","v":0},0,0,0,0,0,{"$f":"IF(AND(Skriveni!C1473<>0,Skriveni!D1473<>0),1,0)","v":0}]
[156,39,{"$f":"'P-VRIO'!D43","v":0},{"$f":"'P-VRIO'!E43","v":0},0,0,0,0,0,{"$f":"IF(AND(Skriveni!C1474<>0,Skriveni!D1474<>0),1,0)","v":0}]
[156,40,{"$f":"'P-VRIO'!D44","v":0},{"$f":"'P-VRIO'!E44","v":0},0,0,0,0,0]
[156,41,{"$f":"'P-VRIO'!D45","v":0},{"$f":"'P-VRIO'!E45","v":0},0,0,0,0,{"$f":"G1476*H1476","v":0},{"$f":"IF(AND(Skriveni!C1476<>0,Skriveni!D1476<>0),1,0)","v":0}]
[156,42,{"$f":"'P-VRIO'!D46","v":0},{"$f":"'P-VRIO'!E46","v":0},0,0,0,0,0,{"$f":"IF(AND(Skriveni!C1477<>0,Skriveni!D1477<>0),1,0)","v":0}]
[156,43,{"$f":"'P-VRIO'!D47","v":0},{"$f":"'P-VRIO'!E47","v":0},0,0,0,0,0,{"$f":"IF(AND(Skriveni!C1478<>0,Skriveni!D1478<>0),1,0)","v":0}]
[156,44,{"$f":"'P-VRIO'!D48","v":0},{"$f":"'P-VRIO'!E48","v":0},0,0,0,0,0,{"$f":"IF(AND(Skriveni!C1479<>0,Skriveni!D1479<>0),1,0)","v":0}]
[159,1,{"$f":"OBVEZE!D5","v":4503.8100000000004},null,0,0,{"$f":"B1480/1000*C1480","v":4.5038100000000005},{"$f":"ABS(C1480-ROUND(C1480,0))","v":0.18999999999959982}]
[159,2,{"$f":"OBVEZE!D6","v":105230.97},0,0,0,210.46194,2.9999999998835847E-2]
[159,3,{"$f":"OBVEZE!D7","v":0},0,0,0,0,0]
[159,4,{"$f":"OBVEZE!D8","v":85905.13},0,0,0,343.62052,0.13000000000465661]
[159,5,{"$f":"OBVEZE!D9","v":58213.3},0,0,0,291.06650000000002,0.30000000000291038]
[159,6,{"$f":"OBVEZE!D10","v":27691.83},0,0,0,166.15098,0.16999999999825377]
[159,7,{"$f":"OBVEZE!D11","v":0},0,0,0,0,0]
[159,8,{"$f":"OBVEZE!D12","v":0},0,0,0,0,0]
[159,9,{"$f":"OBVEZE!D13","v":0},0,0,0,{"$f":"B1488/1000*C1488","v":0},{"$f":"ABS(C1488-ROUND(C1488,0))","v":0}]
[159,10,{"$f":"OBVEZE!D14","v":0},0,0,0,0,0]
[159,11,{"$f":"OBVEZE!D15","v":0},0,0,0,0,0]
[159,12,{"$f":"OBVEZE!D16","v":0},0,0,0,0,0]
[159,13,{"$f":"OBVEZE!D17","v":19325.84},0,0,0,251.23591999999999,0.15999999999985448]
[159,14,{"$f":"OBVEZE!D18","v":0},0,0,0,0,0]
[159,15,{"$f":"OBVEZE!D19","v":0},0,0,0,0,0]
[159,16,{"$f":"OBVEZE!D20","v":0},0,0,0,0,0]
[159,17,{"$f":"OBVEZE!D21","v":0},0,0,0,0,0]
[159,18,{"$f":"OBVEZE!D22","v":0},0,0,0,0,0]
[159,19,{"$f":"OBVEZE!D23","v":0},0,0,0,0,0]
[159,20,{"$f":"OBVEZE!D24","v":104172.9},0,0,0,2083.4580000000001,0.10000000000582077]
[159,21,{"$f":"OBVEZE!D25","v":0},0,0,0,0,0]
[159,22,{"$f":"OBVEZE!D26","v":85265.05},0,0,0,1875.8310999999999,5.0000000002910383E-2]
[159,23,{"$f":"OBVEZE!D27","v":57586.65},0,0,0,1324.4929500000001,0.34999999999854481]
[159,24,{"$f":"OBVEZE!D28","v":27678.400000000001},0,0,0,664.28160000000003,0.40000000000145519]
[159,25,{"$f":"OBVEZE!D29","v":0},0,0,0,0,0]
[159,26,{"$f":"OBVEZE!D30","v":0},0,0,0,0,0]
[159,27,{"$f":"OBVEZE!D31","v":0},0,0,0,{"$f":"B1506/1000*C1506","v":0},{"$f":"ABS(C1506-ROUND(C1506,0))","v":0}]
[159,28,{"$f":"OBVEZE!D32","v":0},0,0,0,0,0]
[159,29,{"$f":"OBVEZE!D33","v":0},0,0,0,0,0]
[159,30,{"$f":"OBVEZE!D34","v":0},0,0,0,0,0]
[159,31,{"$f":"OBVEZE!D35","v":18907.849999999999},0,0,0,586.14334999999994,0.15000000000145519]
[159,32,{"$f":"OBVEZE!D36","v":0},0,0,0,0,0]
[159,33,{"$f":"OBVEZE!D37","v":0},0,0,0,0,0]
[159,34,{"$f":"OBVEZE!D38","v":0},0,0,0,0,0]
[159,35,{"$f":"OBVEZE!D39","v":0},0,0,0,0,0]
[159,36,{"$f":"OBVEZE!D40","v":0},0,0,0,0,0]
[159,37,{"$f":"OBVEZE!D41","v":0},0,0,0,0,0]
[159,38,{"$f":"OBVEZE!D42","v":5561.8800000000047},0,0,0,211.35144000000017,0.11999999999534339]
[159,39,{"$f":"OBVEZE!D43","v":0},0,0,0,0,0]
[159,40,{"$f":"OBVEZE!D44","v":0},0,0,0,0,0]
[159,41,{"$f":"OBVEZE!D45","v":0},0,0,0,0,0]
[159,42,{"$f":"OBVEZE!D46","v":0},0,0,0,0,0]
[159,43,{"$f":"OBVEZE!D47","v":0},0,0,0,0,0]
[159,44,{"$f":"OBVEZE!D48","v":0},0,0,0,0,0]
[159,45,{"$f":"OBVEZE!D49","v":0},0,0,0,0,0]
[159,46,{"$f":"OBVEZE!D50","v":0},0,0,0,0,0]
[159,47,{"$f":"OBVEZE!D51","v":0},0,0,0,0,0]
[159,48,{"$f":"OBVEZE!D52","v":0},0,0,0,0,0]
[159,49,{"$f":"OBVEZE!D53","v":0},0,0,0,0,0]
[159,50,{"$f":"OBVEZE!D54","v":0},0,0,0,0,0]
[159,51,{"$f":"OBVEZE!D55","v":0},0,0,0,0,0]
[159,52,{"$f":"OBVEZE!D56","v":0},0,0,0,0,0]
[159,53,{"$f":"OBVEZE!D57","v":0},0,0,0,0,0]
[159,54,{"$f":"OBVEZE!D58","v":0},0,0,0,0,0]
[159,55,{"$f":"OBVEZE!D59","v":0},0,0,0,0,0]
[159,56,{"$f":"OBVEZE!D60","v":0},0,0,0,0,0]
[159,57,{"$f":"OBVEZE!D61","v":0},0,0,0,0,0]
[159,58,{"$f":"OBVEZE!D62","v":0},0,0,0,0,0]
[159,59,{"$f":"OBVEZE!D63","v":0},0,0,0,0,0]
[159,60,{"$f":"OBVEZE!D64","v":0},0,0,0,0,0]
[159,61,{"$f":"OBVEZE!D65","v":0},0,0,0,0,0]
[159,62,{"$f":"OBVEZE!D66","v":0},0,0,0,0,0]
[159,63,{"$f":"OBVEZE!D67","v":0},0,0,0,0,0]
[159,64,{"$f":"OBVEZE!D68","v":0},0,0,0,0,0]
[159,65,{"$f":"OBVEZE!D69","v":0},0,0,0,0,0]
[159,66,{"$f":"OBVEZE!D70","v":0},0,0,0,{"$f":"B1545/1000*C1545","v":0},{"$f":"ABS(C1545-ROUND(C1545,0))","v":0}]
[159,67,{"$f":"OBVEZE!D71","v":0},0,0,0,0,0]
[159,68,{"$f":"OBVEZE!D72","v":0},0,0,0,0,0]
[159,69,{"$f":"OBVEZE!D73","v":0},0,0,0,0,0]
[159,70,{"$f":"OBVEZE!D74","v":0},0,0,0,0,0]
[159,71,{"$f":"OBVEZE!D75","v":0},0,0,0,0,0]
[159,72,{"$f":"OBVEZE!D76","v":0},0,0,0,0,0]
[159,73,{"$f":"OBVEZE!D77","v":0},0,0,0,0,0]
[159,74,{"$f":"OBVEZE!D78","v":0},0,0,0,0,0]
[159,75,{"$f":"OBVEZE!D79","v":0},0,0,0,0,0]
[159,76,{"$f":"OBVEZE!D80","v":0},0,0,0,0,0]
[159,77,{"$f":"OBVEZE!D81","v":0},0,0,0,0,0]
[159,78,{"$f":"OBVEZE!D82","v":0},0,0,0,0,0]
[159,79,{"$f":"OBVEZE!D83","v":0},0,0,0,0,0]
[159,80,{"$f":"OBVEZE!D84","v":0},0,0,0,0,0]
[159,81,{"$f":"OBVEZE!D85","v":0},0,0,0,0,0]
[159,82,{"$f":"OBVEZE!D86","v":0},0,0,0,0,0]
[159,83,{"$f":"OBVEZE!D87","v":0},0,0,0,0,0]
[159,84,{"$f":"OBVEZE!D88","v":0},0,0,0,0,0]
[159,85,{"$f":"OBVEZE!D89","v":0},0,0,0,0,0]
[159,86,{"$f":"OBVEZE!D90","v":0},0,0,0,0,0]
[159,87,{"$f":"OBVEZE!D91","v":0},0,0,0,0,0]
[159,88,{"$f":"OBVEZE!D92","v":0},0,0,0,0,0]
[159,89,{"$f":"OBVEZE!D93","v":0},0,0,0,0,0]
[159,90,{"$f":"OBVEZE!D94","v":0},0,0,0,0,0]
[159,91,{"$f":"OBVEZE!D95","v":0},0,0,0,0,0]
[159,92,{"$f":"OBVEZE!D96","v":0},0,0,0,0,0]
[159,93,{"$f":"OBVEZE!D97","v":0},0,0,0,0,0]
[159,94,{"$f":"OBVEZE!D98","v":0},0,0,0,0,0]
[159,95,{"$f":"OBVEZE!D99","v":0},0,0,0,0,0]
[159,96,{"$f":"OBVEZE!D100","v":0},0,0,0,0,0]
[159,97,{"$f":"OBVEZE!D101","v":5561.88},0,0,0,539.50236000000007,0.11999999999989086]
[159,98,{"$f":"OBVEZE!D102","v":0},0,0,0,0,0]
[159,99,{"$f":"OBVEZE!D103","v":5143.8900000000003},0,0,0,509.24511000000007,0.10999999999967258]
[159,100,{"$f":"OBVEZE!D104","v":417.99},0,0,0,41.799000000000007,9.9999999999909051E-3]
[159,101,{"$f":"OBVEZE!D105","v":0},0,0,0,0,0]

{"sheet":"Upute","index":1,"n_rows":11,"n_cols":1,"rows_kept":11,"cut":false,"hidden":false,"merged":[]}
["OSNOVNE UPUTE ZA UNOS PODATAKA"]
[]
["Izvještaji su napravljeni u Excel datoteci te u slučaju popunjavanja obrasca u starim verzijama MS Excel-a važno je da se datoteka spremi u novoj verziji, tj. mora se snimiti u novijem \".xlsx\" formatu. Predaja ovih obrazaca moguća je samo putem web servisa."]
["Sva bitna pravila o popunjavanju obrazaca, poslovnim pravilima navedena su u nastavku uputa, ono što nije objašnjeno u uputama opisano je u kontrolama koje javljaju pogrešku. Prije nego rješenje problema potražite na broju telefona ili adresi e-pošte na dnu uputa, pokušajte ga pronaći u sklopu uputa. Također, novost je da prilikom uvoza samog dokumenta u aplikaciju, u slučaju pogreški, aplikacija će iste javiti!"]
["Analizom najčešćih pogrešaka prilikom popunjavanja i predaje, nastojali smo na najmanju moguću mjeru smanjiti mogućnost pogreške pri popunjavanju te olakšati pronalaženje pogrešaki. Pozadina ćelije koja je upisana s predznakom minus tamo gdje to nije dopušteno obojat će se crvenom bojom. Iako je onemogućen ručni upis takvih podataka, programi koji pune Excel datoteku mogu u svaku ćeliju \"zgurati\" bilo kakvu vrijednost pa je kontrola ovog tipa potrebna. Također, novost je da prilikom uvoza samog dokumenta u aplikaciju, u slučaju pogreški, aplikacija će iste javiti!"]
["U nastavku su dane tehničke upute o popunjavanju obrazaca."]
["U obrasce se unose iznosi samo pojedinačnih stavki. Sumarne stavke zaštićene su, u njih nije moguć unos, a izračunavaju se automatski na osnovu upisanih pojedinačnih iznosa. Iznosi s lipama su dopušteni. Sumarne stavke u obrascu su plave boje s podebljanim tipom slova (bold) da se bolje razlikuju. Vrijednosti tih pozicija izračunat će se automatski na osnovu upisanih pojedinačnih stavaka. Na obrascima koji imaju stupac indeks, taj podatak se ne upisuje već se izračunava automatski na osnovu upisanih vrijednosti. Tamo gdje indeks nije moguće izračunati pojavit će se crtica \"-\", a tamo gdje je indeks veći od 1000 pojavit će se tekst \">>100\"."]
["Vrlo važno: Kod unosa vrijednosti naprednijim metodama Kopiraj/Zalijepi (Copy/Paste) iz nekih drugih dokumenata OBAVEZNO koristite metodu Copy (Kopiraj), a ne Cut (Izreži), jer se kod korištenja metode Cut/Paste nepovratno pokvari struktura datoteke. Isto tako, kod Paste metode koristite opciju Paste Special (Posebno lijepljenje), pa odaberite Vrijednosti (Value). Ni u kom slučaju ne prenosite krivo upisane iznose s jedne pozicije u excel-u na drugu tako da ih odvlačite mišem na ispravno mjesto. Ovo je i dalje vrlo česta pogreška i takav način rada trajno oštećuje Excel datoteku (potrebno je novu popuniti od nule). Ni u kom slučaju ne brišite postojeće radne listove, ne mijenjajte nazive postojećih, ne uključujte dijeljenje ili zaštitu radne knjige, ne ubacujte linkove na neke druge dokumente. S obzirom da su svi radni listovi međusobno povezani formulama koje služe kao kontrola, svaka od spomenutih radnji rezultira da Excel datoteka postane neupotrebljiva za računalnu obradu i morat ćete ispuniti novu datoteku."]
["Kontrole obrazaca su na razini pojedinog obrasca. Kontrole na razini pojedinog obrasca provjeravajte nakon popunjavanja tog obrasca. Ako neka kontrola nije zadovoljena ispravite podatak. "]
["Korisnici Open Office-a:  Koristite li starije verzije OpenOffice-a možete s Interneta besplatno skinuti zadnju verziju OpenOffice-a, jer obrasci popunjeni u starijim verzijama mogli bi biti nečitki nakon predaje u aplikaciju. Također, neke verzije Excel-a ne rade dobro bez svih zakrpa (Service Pack-ova), zato provjerite sa svojim informatičarima imate li na računalu instalirane sve zakrpe za program koji koristitie za popunjavanje. Ispravan format ima nastavak .xlsx. Promjena samo nastavka u nazivu datoteke ne mijenja stvarni format datoteke pa će takva datoteka i dalje biti problem ako je samo preimenujete iz *.xls u *.xlsx."]
["Imate li problema tehničke naravi s popunjavanjem obrasca, radom kontrola i slično, dostavite nam popunjenu problematičnu Excel datoteku zajedno s Vašim kontakt podacima te podacima o programu koji i koju verziju koristite za popunjavanje na adresu e-pošte: rkpfi@mfin.hr. "]

{"sheet":"RefStr","index":2,"n_rows":39,"n_cols":9,"rows_kept":39,"cut":false,"hidden":false,"merged":[[7,5,7,6],[8,5,8,6],[1,0,1,8],[3,0,3,8],[6,4,10,4],[6,5,6,6],[9,5,9,6],[10,5,10,6],[15,0,18,0],[19,0,22,0],[23,0,27,0],[28,0,31,0],[32,0,35,0],[14,1,14,5],[15,1,15,5],[16,1,16,5],[17,1,17,5],[18,1,18,5],[19,1,19,5],[20,1,20,5],[21,1,21,5],[22,1,22,5],[23,1,23,5],[38,7,38,8],[24,1,24,5],[25,1,25,5],[33,1,33,5],[34,1,34,5],[35,1,35,5],[26,1,26,5],[27,1,27,5],[28,1,28,5],[29,1,29,5],[30,1,30,5],[31,1,31,5],[32,1,32,5]]}
[]
["REFERENTNA STRANICA"]
[null,null,null,null,null,null,null,null,"Verzija 8.1.3"]
["Izvještaji proračuna, proračunskih i izvanproračunskih korisnika"]
[]
[null,"RKP:",42635,null,null,null,null,"Popunjen","Broj pogrešaka"]
[null,null,null,null,"Pregled \npopunjenosti\nobrazaca:","PR-RAS",null,{"$f":"IF(OR(MAX(Skriveni!C2:F983)>0,MIN(Skriveni!C2:F983)<0),\"DA\",\"NE\")","v":"DA"},{"$f":"IF(AND(H7=\"DA\",Kont!E20>0),Kont!E20,\"Nema\")","v":"Nema"}]
[null,"Naziv obveznika:","GRADSKA KNJIŽNICA BAKAR",null,null,"BILANCA",null,{"$f":"IF(OR(MAX(Skriveni!C984:D1298)>0,MIN(Skriveni!C984:D1298)<0),\"DA\",\"NE\")","v":"DA"},{"$f":"IF(AND(H8=\"DA\",Kont!E277>0),Kont!E277,\"Nema\")","v":"Nema"}]
[null,null,null,null,null,"RAS funkcijski",null,{"$f":"IF(OR(MAX(Skriveni!C1299:D1435)>0,MIN(Skriveni!C1299:D1435)<0),\"DA\",\"NE\")","v":"DA"},{"$f":"IF(AND(H9=\"DA\",Kont!E316>0),Kont!E316,\"Nema\")","v":"Nema"}]
[null,"Razina:",21,null,null,"P-VRIO",null,{"$f":"IF(OR(SUMPRODUCT(--('P-VRIO'!D8:E13<>\"\"))<>0,SUMPRODUCT(--('P-VRIO'!D15:E21<>\"\"))<>0,SUMPRODUCT(--('P-VRIO'!D24:E29<>\"\"))<>0,SUMPRODUCT(--('P-VRIO'!D31:E37<>\"\"))<>0,SUMPRODUCT(--('P-VRIO'!D40:E43<>\"\"))<>0,SUMPRODUCT(--('P-VRIO'!D45:E48<>\"\"))<>0),\"DA\",\"NE\")","v":"DA"},{"$f":"IF(Kont!E314>0,Kont!E314,\"Nema\")","v":"Nema"}]
[null,null,null,null,null,"OBVEZE",null,{"$f":"IF(OR(MAX(Skriveni!C1480:C1580)>0,MIN(Skriveni!C1480:C1580)<0),\"DA\",\"NE\")","v":"DA"},{"$f":"IF(AND(H11=\"DA\",Kont!E311>0),Kont!E311,\"Nema\")","v":"Nema"}]
[null,"Oznaka razdoblja:","2023-12"]
[]
[]
["Obrazac","Opis stavke",null,null,null,null,"Šifra","Prethodna godina / početak godine","Tekuća godina / kraj godine"]
["PR-RAS",{"$f":"'PR-RAS'!B6","v":"PRIHODI POSLOVANJA (šifre 61+62+63+64+65+66+67+68) "},null,null,null,null,{"$f":"'PR-RAS'!C6","v":"6"},{"$f":"'PR-RAS'!D6","v":95889.13},{"$f":"'PR-RAS'!E6","v":112184.11}]
[null,{"$f":"'PR-RAS'!B151","v":"RASHODI POSLOVANJA (šifre 31+32+34+35+36+37+38) "},null,null,null,null,{"$f":"'PR-RAS'!C151","v":"3"},{"$f":"'PR-RAS'!D151","v":77222.87000000001},{"$f":"'PR-RAS'!E151","v":87498.09}]
[null,{"$f":"'PR-RAS'!B645","v":"Višak prihoda i primitaka raspoloživ u sljedećem razdoblju (šifre X005 + '9221-9222' - Y005 - '9222-9221')"},null,null,null,null,{"$f":"'PR-RAS'!C645","v":"X006"},{"$f":"'PR-RAS'!D645","v":6629.9299999999967},{"$f":"'PR-RAS'!E645","v":5536.5500000000093}]
[null,{"$f":"'PR-RAS'!B646","v":"Manjak prihoda i primitaka za pokriće u sljedećem razdoblju (šifre Y005 + '9222-9221' - X005 - '9221-9222' )"},null,null,null,null,{"$f":"'PR-RAS'!C646","v":"Y006"},{"$f":"'PR-RAS'!D646","v":0},{"$f":"'PR-RAS'!E646","v":0}]
["BILANCA",{"$f":"BILANCA!B7","v":"Nefinancijska imovina (šifre 01+02+03+04+05+06)"},null,null,null,null,{"$f":"BILANCA!C7","v":"B002"},{"$f":"BILANCA!D7","v":66223.130000000034},{"$f":"BILANCA!E7","v":62411.69}]
[null,{"$f":"BILANCA!B68","v":"Financijska imovina (šifre 11+12+13+14+15+16+17+19)"},null,null,null,null,{"$f":"BILANCA!C68","v":"1"},{"$f":"BILANCA!D68","v":11170.24},{"$f":"BILANCA!E68","v":11105.73}]
[null,{"$f":"BILANCA!B176","v":"Obveze (šifre 23+24+25+26+29) "},null,null,null,null,{"$f":"BILANCA!C176","v":"2"},{"$f":"BILANCA!D176","v":4503.8100000000004},{"$f":"BILANCA!E176","v":5561.88}]
[null,{"$f":"BILANCA!B237","v":"Vlastiti izvori (šifre 91 + 922 - 93 + 96 do 98)"},null,null,null,null,{"$f":"BILANCA!C237","v":"9"},{"$f":"BILANCA!D237","v":72889.56},{"$f":"BILANCA!E237","v":67955.540000000008}]
["RAS-funkcijski",{"$f":"'RAS-funkcijski'!B5","v":"Opće javne usluge (šifre 011+012+013+014 do 018)"},null,null,null,null,{"$f":"'RAS-funkcijski'!C5","v":"01"},{"$f":"'RAS-funkcijski'!D5","v":0},{"$f":"'RAS-funkcijski'!E5","v":0}]
[null,{"$f":"'RAS-funkcijski'!B35","v":"Ekonomski poslovi (šifre 041+042+043+044+045+046+047+048+049)"},null,null,null,null,{"$f":"'RAS-funkcijski'!C35","v":"04"},{"$f":"'RAS-funkcijski'!D35","v":0},{"$f":"'RAS-funkcijski'!E35","v":0}]
[null,{"$f":"'RAS-funkcijski'!B88","v":"Rashodi vezani za stanovanje i kom. pogodnosti koji nisu drugdje svrstani"},null,null,null,null,{"$f":"'RAS-funkcijski'!C88","v":"066"},{"$f":"'RAS-funkcijski'!D88","v":0},{"$f":"'RAS-funkcijski'!E88","v":0}]
[null,{"$f":"'RAS-funkcijski'!B114","v":"Obrazovanje (šifre 091+092+093+094+095+096+097+098)"},null,null,null,null,{"$f":"'RAS-funkcijski'!C114","v":"09"},{"$f":"'RAS-funkcijski'!D114","v":0},{"$f":"'RAS-funkcijski'!E114","v":0}]
[null,{"$f":"'RAS-funkcijski'!B141","v":"Kontrolni zbroj (šifre 01+02+03+04+05+06+07+08+09+10)"},null,null,null,null,{"$f":"'RAS-funkcijski'!C141","v":"R1"},{"$f":"'RAS-funkcijski'!D141","v":94377.54},{"$f":"'RAS-funkcijski'!E141","v":113277.49}]
["P-VRIO",{"$f":"'P-VRIO'!B5","v":"Promjene u vrijednosti i obujmu imovine (šifre 91511+91512)"},null,null,null,null,{"$f":"'P-VRIO'!C5","v":"9151"},{"$f":"'P-VRIO'!D5","v":6840.64},{"$f":"'P-VRIO'!E5","v":3347.3}]
[null,{"$f":"'P-VRIO'!B22","v":"Promjene u obujmu imovine (šifre P016+P023)"},null,null,null,null,{"$f":"'P-VRIO'!C22","v":"91512"},{"$f":"'P-VRIO'!D22","v":6840.64},{"$f":"'P-VRIO'!E22","v":41.69}]
[null,{"$f":"'P-VRIO'!B38","v":"Promjene u vrijednosti (revalorizacija) i obujmu obveza (šifre 91521+91522)"},null,null,null,null,{"$f":"'P-VRIO'!C38","v":"9152"},{"$f":"'P-VRIO'!D38","v":0},{"$f":"'P-VRIO'!E38","v":0}]
[null,{"$f":"'P-VRIO'!B44","v":"Promjene u obujmu obveza (šifre P035 do P038)"},null,null,null,null,{"$f":"'P-VRIO'!C44","v":"91522"},{"$f":"'P-VRIO'!D44","v":0},{"$f":"'P-VRIO'!E44","v":0}]
["OBVEZE",{"$f":"OBVEZE!B5","v":"Stanje obveza 1. siječnja (=stanju obveza iz Izvještaja o obvezama na 31. prosinca prethodne godine)"},null,null,null,null,{"$f":"OBVEZE!C5","v":"V001"},"-",{"$f":"OBVEZE!D5","v":4503.8100000000004}]
[null,{"$f":"OBVEZE!B42","v":"Stanje obveza na kraju izvještajnog razdoblja (šifre V001+V002-V004) i (šifre V007+V009)"},null,null,null,null,{"$f":"OBVEZE!C42","v":"V006"},"-",{"$f":"OBVEZE!D42","v":5561.8800000000047}]
[null,{"$f":"OBVEZE!B43","v":"Stanje dospjelih obveza na kraju izvještajnog razdoblja (šifre V008+D23+D24 + 'D dio 25,26')"},null,null,null,null,{"$f":"OBVEZE!C43","v":"V007"},"-",{"$f":"OBVEZE!D43","v":0}]
[null,{"$f":"OBVEZE!B101","v":"Stanje nedospjelih obveza na kraju izvještajnog razdoblja (šifre V010 + ND23 + ND24 + 'ND dio 25,26')"},null,null,null,null,{"$f":"OBVEZE!C101","v":"V009"},"-",{"$f":"OBVEZE!D101","v":5561.88}]
[]
[]
[null,null,null,null,null,null,null,"Potpis odgovorne osobe i pečat"]

{"sheet":"PR-RAS","index":3,"n_rows":992,"n_cols":6,"rows_kept":992,"cut":false,"hidden":false,"merged":[[993,3,993,4],[994,3,994,4],[982,0,982,1],[1,0,1,5],[4,0,4,1],[296,0,296,1],[418,0,418,1],[647,0,647,1]]}
["Obveznik:",null,"Razina:",null,"Razdoblje:"]
["IZVJEŠTAJ O PRIHODIMA I RASHODIMA, PRIMICIMA I IZDACIMA"]
["Račun iz Rač. plana","Opis stavke","Šifra","Ostvareno u izvještajnom razdoblju preth. godine","Ostvareno u izvještajnom razdoblju \ntekuće godine","Indeks\n(5/4)"]
[1,2,"3",4,5,6]
["Prihodi i rashodi poslovanja"]
[6,"PRIHODI POSLOVANJA (šifre 61+62+63+64+65+66+67+68) ","6",{"$f":"D7+D44+D50+D82+D106+D124+D133+D139","v":95889.13},{"$f":"E7+E44+E50+E82+E106+E124+E133+E139","v":112184.11},{"$f":"IF(D6<>0,IF(E6/D6>=100,\">>100\",E6/D6*100),\"-\")","v":116.99356329544339}]
[61,"Prihodi od poreza (šifre 611+612+613+614+615+616)","61",{"$f":"D8+D17+D23+D29+D37+D40","v":0},0,"-"]
[611,"Porez i prirez na dohodak (šifre 6111 do 6116 - 6117 - 6119)","611",{"$f":"SUM(D9:D14)-D15-D16","v":0},0,"-"]
[6111,"Porez i prirez na dohodak od nesamostalnog rada","6111",0,0,"-"]
[6112,"Porez i prirez na dohodak od samostalnih djelatnosti","6112",0,0,"-"]
[6113,"Porez i prirez na dohodak od imovine i imovinskih prava","6113",0,0,"-"]
[6114,"Porez i prirez na dohodak od kapitala","6114",0,0,"-"]
[6115,"Porez i prirez na dohodak po godišnjoj prijavi","6115",0,0,"-"]
[6116,"Porez i prirez na dohodak utvrđen u postupku nadzora za prethodne godine ","6116",0,0,"-"]
[6117,"Povrat poreza i prireza na dohodak po godišnjoj prijavi","6117",0,0,"-"]
[6119,"Povrat više ostvarenog poreza na dohodak za decentralizirane funkcije","6119",0,0,"-"]
[612,"Porez na dobit (šifre 6121 do 6124 - 6125)","612",{"$f":"SUM(D18:D21)-D22","v":0},0,"-"]
[6121,"Porez na dobit od poduzetnika","6121",0,0,"-"]
[6122,"Porez na dobit po odbitku na naknade za korištenje prava i za usluge","6122",0,0,"-"]
[6123,"Porez na dobit po odbitku na kamate, dividende i udjele u dobiti","6123",0,0,"-"]
[6124,"Porez na dobit po godišnjoj prijavi","6124",0,0,"-"]
[6125,"Povrat poreza na dobit po godišnjoj prijavi","6125",0,0,"-"]
[613,"Porezi na imovinu (šifre 6131 do 6135)","613",{"$f":"SUM(D24:D28)","v":0},0,"-"]
[6131,"Stalni porezi na nepokretnu imovinu","6131",0,0,"-"]
[6132,"Porez na nasljedstva i darove","6132",0,0,"-"]
[6133,"Porez na kapitalne i financijske transakcije","6133",0,0,"-"]
[6134,"Povremeni porezi na imovinu","6134",0,0,"-"]
[6135,"Ostali stalni porezi na imovinu","6135",0,0,"-"]
[614,"Porezi na robu i usluge (šifre 6141 do 6148) ","614",{"$f":"SUM(D30:D36)","v":0},0,"-"]
[6141,"Porez na dodanu vrijednost","6141",0,0,"-"]
[6142,"Porez na promet","6142",0,0,"-"]
[6143,"Posebni porezi i trošarine ","6143",0,0,"-"]
[6145,"Porezi na korištenje dobara ili izvođenje aktivnosti","6145",0,0,"-"]
[6146,"Ostali porezi na robu i usluge","6146",0,0,"-"]
[6147,"Porez na dobitke od igara na sreću i ostali porezi od igara na sreću","6147",0,0,"-"]
[6148,"Naknade za priređivanje igara na sreću","6148",0,0,"-"]
[615,"Porezi na međunarodnu trgovinu i transakcije (šifre 6151+6152)","615",{"$f":"SUM(D38:D39)","v":0},0,"-"]
[6151,"Carine i carinske pristojbe","6151",0,0,"-"]
[6152,"Ostali porezi na međunarodnu trgovinu i transakcije","6152",0,0,"-"]
[616,"Ostali prihodi od poreza (šifre 6161 do 6163)","616",{"$f":"SUM(D41:D43)","v":0},0,"-"]
[6161,"Ostali prihodi od poreza koje plaćaju pravne osobe","6161",0,0,"-"]
[6162,"Ostali prihodi od poreza koje plaćaju fizičke osobe","6162",0,0,"-"]
[6163,"Ostali neraspoređeni prihodi od poreza","6163",0,0,"-"]
[62,"Doprinosi (šifre 621+622+623)","62",{"$f":"D45+D48+D49","v":0},0,"-"]
[621,"Doprinosi za zdravstveno osiguranje (šifre 6211+6212) ","621",{"$f":"SUM(D46:D47)","v":0},0,"-"]
[6211,"Doprinosi za obvezno zdravstveno osiguranje ","6211",0,0,"-"]
[6212,"Doprinosi za obvezno zdravstveno osiguranje za slučaj ozljede na radu","6212",0,0,"-"]
[622,"Doprinosi za mirovinsko osiguranje","622",0,0,"-"]
[623,"Doprinosi za zapošljavanje","623",0,0,"-"]
[63,"Pomoći iz inozemstva i od subjekata unutar općeg proračuna (šifre 631+632+633+634+635+636+637+638+639)","63",{"$f":"D51+D54+D59+D62+D65+D68+D71+D74+D77","v":5308.91},{"$f":"E51+E54+E59+E62+E65+E68+E71+E74+E77","v":8145.3},153.42697465204722]
[631,"Pomoći od inozemnih vlada (šifre 6311+6312)","631",{"$f":"D52+D53","v":0},0,"-"]
[6311,"Tekuće pomoći od inozemnih vlada","6311",0,0,"-"]
[6312,"Kapitalne pomoći od inozemnih vlada","6312",0,0,"-"]
[632,"Pomoći od međunarodnih organizacija te institucija i tijela EU (šifre 6321 do 6324)","632",{"$f":"SUM(D55:D58)","v":0},0,"-"]
[6321,"Tekuće pomoći od međunarodnih organizacija","6321",0,0,"-"]
[6322,"Kapitalne pomoći od međunarodnih organizacija","6322",0,0,"-"]
[6323,"Tekuće pomoći od institucija i tijela EU","6323",0,0,"-"]
[6324,"Kapitalne pomoći od institucija i tijela EU","6324",0,0,"-"]
[633,"Pomoći proračunu iz drugih proračuna i izvanproračunskim korisnicima (šifre 6331+6332)","633",{"$f":"SUM(D60:D61)","v":0},0,"-"]
[6331,"Tekuće pomoći proračunu iz drugih proračuna i izvanproračunskim korisnicima","6331",0,0,"-"]
[6332,"Kapitalne pomoći proračunu iz drugih proračuna i izvanproračunskim korisnicima","6332",0,0,"-"]
[634,"Pomoći od izvanproračunskih korisnika (šifre 6341+6342)","634",{"$f":"SUM(D63:D64)","v":0},0,"-"]
[6341,"Tekuće pomoći od izvanproračunskih korisnika","6341",0,0,"-"]
[6342,"Kapitalne pomoći od izvanproračunskih korisnika ","6342",0,0,"-"]
[635,"Pomoći izravnanja za decentralizirane funkcije (šifre 6351+6352)","635",{"$f":"SUM(D66:D67)","v":0},0,"-"]
[6351,"Tekuće pomoći izravnanja za decentralizirane funkcije","6351",0,0,"-"]
[6352,"Kapitalne pomoći izravnanja za decentralizirane funkcije","6352",0,0,"-"]
["636","Pomoći proračunskim korisnicima iz proračuna koji im nije nadležan (šifre 6361+6362)","636",{"$f":"SUM(D69:D70)","v":5308.91},8145.3,153.42697465204722]
["6361","Tekuće pomoći proračunskim korisnicima iz proračuna koji im nije nadležan","6361",0,0,"-"]
["6362","Kapitalne pomoći proračunskim korisnicima iz proračuna koji im nije nadležan","6362",5308.91,8145.3,153.42697465204722]
["637","Pomoći unutar općeg proračuna temeljem protestiranih jamstava (šifra 6371+6372)","637",{"$f":"SUM(D72:D73)","v":0},0,"-"]
["6371","Pomoći primljene unutar općeg proračuna po protestiranim jamstvima","6371",0,0,"-"]
["6372","Povrat pomoći danih unutar općeg proračuna po protestiranim jamstvima","6372",0,0,"-"]
["638","Pomoći temeljem prijenosa  EU sredstava (šifre 6381+6382)","638",{"$f":"SUM(D75:D76)","v":0},0,"-"]
["6381","Tekuće pomoći temeljem prijenosa  EU sredstava","6381",0,0,"-"]
["6382","Kapitalne pomoći temeljem prijenosa  EU sredstava","6382",0,0,"-"]
["639","Prijenosi između proračunskih korisnika istog proračuna (šifre 6391 do 6394)","639",{"$f":"SUM(D78:D81)","v":0},0,"-"]
[6391,"Tekući prijenosi između proračunskih korisnika istog proračuna","6391",0,0,"-"]
[6392,"Kapitalni prijenosi između proračunskih korisnika istog proračuna","6392",0,0,"-"]
[6393,"Tekući prijenosi između proračunskih korisnika istog proračuna temeljem prijenosa EU sredstava","6393",0,0,"-"]
[6394,"Kapitalni prijenosi između proračunskih korisnika istog proračuna temeljem prijenosa EU sredstava","6394",0,0,"-"]
[64,"Prihodi od imovine (šifre 641+642+643)","64",{"$f":"D83+D91+D98","v":0},0,"-"]
[641,"Prihodi od financijske imovine (šifre 6412 do 6419) ","641",{"$f":"SUM(D84:D90)","v":0},0,"-"]
[6412,"Prihodi od kamata po vrijednosnim papirima","6412",0,0,"-"]
[6413,"Kamate na oročena sredstva i depozite po viđenju","6413",0,0,"-"]
[6414,"Prihodi od zateznih kamata ","6414",0,0,"-"]
[6415,"Prihodi od pozitivnih tečajnih razlika i razlika zbog primjene valutne klauzule","6415",0,0,"-"]
[6416,"Prihodi od dividendi","6416",0,0,"-"]
[6417,"Prihodi iz dobiti trgovačkih društava, kreditnih i ostalih financijskih institucija po posebnim propisima","6417",0,0,"-"]
[6419,"Ostali prihodi od financijske imovine","6419",0,0,"-"]
[642,"Prihodi od nefinancijske imovine (šifre 6421 do 6429)","642",{"$f":"SUM(D92:D97)","v":0},0,"-"]
[6421,"Naknade za koncesije","6421",0,0,"-"]
[6422,"Prihodi od zakupa i iznajmljivanja imovine","6422",0,0,"-"]
[6423,"Naknada za korištenje nefinancijske imovine","6423",0,0,"-"]
[6424,"Naknade za ceste","6424",0,0,"-"]
["6425","Prihodi od prodaje kratkotrajne nefinancijske imovine","6425",0,0,"-"]
[6429,"Ostali prihodi od nefinancijske imovine","6429",0,0,"-"]
[643,"Prihodi od kamata na dane zajmove (šifre 6431 do 6437)","643",{"$f":"SUM(D99:D105)","v":0},0,"-"]
[6431,"Prihodi od kamata na dane zajmove međunarodnim organizacijama, institucijama i tijelima EU te inozemnim vladama","6431",0,0,"-"]
[6432,"Prihodi od kamata na dane zajmove neprofitnim organizacijama, građanima i kućanstvima","6432",0,0,"-"]
[6433,"Prihodi od kamata na dane zajmove kreditnim i ostalim financijskim institucijama u javnom sektoru","6433",0,0,"-"]
[6434,"Prihodi od kamata na dane zajmove trgovačkim društvima u javnom sektoru","6434",0,0,"-"]
[6435,"Prihodi od kamata na dane zajmove kreditnim i ostalim financijskim institucijama izvan javnog sektora","6435",0,0,"-"]
[6436,"Prihodi od kamata na dane zajmove trgovačkim društvima i obrtnicima izvan javnog sektora","6436",0,0,"-"]
[6437,"Prihodi od kamata na dane zajmove drugim razinama vlasti","6437",0,0,"-"]
[65,"Prihodi od upravnih i administrativnih pristojbi, pristojbi po posebnim propisima i naknada (šifre 651+652+653)","65",{"$f":"D107+D112+D120","v":1101.1300000000001},1060.07,96.271103321133737]
[651,"Upravne i administrativne pristojbe (šifre 6511 do 6514)","651",{"$f":"SUM(D108:D111)","v":0},0,"-"]
[6511,"Državne upravne i sudske pristojbe","6511",0,0,"-"]
[6512,"Županijske, gradske i općinske pristojbe i naknade","6512",0,0,"-"]
[6513,"Ostale upravne pristojbe i naknade","6513",0,0,"-"]
[6514,"Ostale pristojbe i naknade","6514",0,0,"-"]
[652,"Prihodi po posebnim propisima (šifre 6521 do 6528)","652",{"$f":"SUM(D113:D119)","v":1101.1300000000001},1060.07,96.271103321133737]
[6521,"Prihodi državne uprave","6521",0,0,"-"]
[6522,"Prihodi vodnog gospodarstva","6522",0,0,"-"]
[6524,"Doprinosi za šume","6524",0,0,"-"]
[6525,"Mjesni samodoprinos","6525",0,0,"-"]
[6526,"Ostali nespomenuti prihodi","6526",1101.1300000000001,1060.07,96.271103321133737]
[6527,"Naknade od financijske imovine","6527",0,0,"-"]
["6528","Prihodi od novčane naknade poslodavca zbog nezapošljavanja osoba s invaliditetom","6528",0,0,"-"]
[653,"Komunalni doprinosi i naknade (šifre 6531 do 6533)","653",{"$f":"SUM(D121:D123)","v":0},0,"-"]
[6531,"Komunalni doprinosi","6531",0,0,"-"]
[6532,"Komunalne naknade","6532",0,0,"-"]
[6533,"Naknade za priključak","6533",0,0,"-"]
[66,"Prihodi od prodaje proizvoda i robe te pruženih usluga, prihodi od donacija te povrati po protestiranim jamstvima (šifre 661+663)","66",{"$f":"D125+D128","v":564.90000000000009},6599.18,1168.2032218091697]
[661,"Prihodi od prodaje proizvoda i robe te pruženih usluga (šifre 6614+6615)","661",{"$f":"SUM(D126:D127)","v":351.72},191.18,54.355737518480609]
[6614,"Prihodi od prodaje proizvoda i robe","6614",351.72,191.18,54.355737518480609]
[6615,"Prihodi od pruženih usluga","6615",0,0,"-"]
[663,"Donacije od pravnih i fizičkih osoba izvan općeg proračuna i povrat donacija po protestiranim jamstvima (šifre 6631 do 6634)","663",{"$f":"SUM(D129:D132)","v":213.18},6408,3005.91049817056]
[6631,"Tekuće donacije","6631",213.18,null,0]
[6632,"Kapitalne donacije","6632",null,6408,"-"]
["6633","Povrat donacija danih neprofitnim organizacijama, građanima i kućanstvima u tuzemstvu po protestiranim jamstvima","6633",0,0,"-"]
["6634","Povrat kapitalnih pomoći danih trgovačkim društvima i obrtnicima po protestiranim jamstvima","6634",0,0,{"$f":"IF(D132<>0,IF(E132/D132>=100,\">>100\",E132/D132*100),\"-\")","v":"-"}]
[67,"Prihodi iz nadležnog proračuna i od HZZO-a na temelju ugovornih obveza (šifre 671+673)","67",{"$f":"D134+D138","v":88783.72},96379.56,{"$f":"IF(D133<>0,IF(E133/D133>=100,\">>100\",E133/D133*100),\"-\")","v":108.555442371642}]
[671,"Prihodi iz nadležnog proračuna za financiranje redovne djelatnosti proračunskih korisnika (šifre 6711 do 6714)","671",{"$f":"SUM(D135:D137)","v":88783.72},96379.56,108.555442371642]
[6711,"Prihodi iz  nadležnog proračuna za financiranje rashoda poslovanja","6711",77616.850000000006,86858.01,111.90612605381433]
[6712,"Prihodi iz nadležnog proračuna za financiranje rashoda za nabavu nefinancijske imovine","6712",11166.87,9521.5499999999993,85.266059334441962]
["6714","Prihodi od nadležnog proračuna za financiranje izdataka za financijsku imovinu i  otplatu zajmova","6714",0,0,"-"]
["673","Prihodi od HZZO-a na temelju ugovornih obveza","673",0,0,"-"]
[68,"Kazne, upravne mjere i ostali prihodi (šifre 681+683)","68",{"$f":"D140+D150","v":130.47},0,0]
[681,"Kazne i upravne mjere (šifre 6811 do 6819)","681",{"$f":"SUM(D141:D149)","v":0},0,"-"]
[6811,"Kazne za carinske prekršaje","6811",0,0,"-"]
[6812,"Kazne za devizne prekršaje","6812",0,0,"-"]
[6813,"Kazne za porezne prekršaje","6813",0,0,"-"]
[6814,"Kazne za prekršaje trgovačkih društava - privredne prijestupe","6814",0,0,"-"]
[6815,"Kazne za prometne i ostale prekršaje u nadležnosti MUP-a","6815",0,0,"-"]
[6816,"Kazne i druge mjere u kaznenom postupku","6816",0,0,"-"]
[6817,"Kazne za prekršaje na kulturnim dobrima","6817",0,0,"-"]
[6818,"Upravne mjere","6818",0,0,"-"]
[6819,"Ostale kazne","6819",0,0,"-"]
[683,"Ostali prihodi","683",130.47,null,0]
[3,"RASHODI POSLOVANJA (šifre 31+32+34+35+36+37+38) ","3",{"$f":"D152+D163+D196+D215+D224+D252+D263","v":77222.87000000001},87498.09,113.3059286711307]
[31,"Rashodi za zaposlene (šifre 311+312+313)","31",{"$f":"D153+D158+D159","v":53351.380000000005},58213.299999999996,109.11301638308134]
[311,"Plaće (bruto) (šifre 3111 do 3114) ","311",{"$f":"SUM(D154:D157)","v":42510.22},46461.22,109.29423559793385]
[3111,"Plaće za redovan rad","3111",42510.22,46461.22,109.29423559793385]
[3112,"Plaće u naravi","3112",0,0,"-"]
[3113,"Plaće za prekovremeni rad","3113",0,0,"-"]
[3114,"Plaće za posebne uvjete rada","3114",0,0,"-"]
[312,"Ostali rashodi za zaposlene","312",3826.97,4085.95,106.76723360778892]
[313,"Doprinosi na plaće (šifre 3131 do 3133)","313",{"$f":"SUM(D160:D162)","v":7014.19},7666.13,109.2945871155472]
[3131,"Doprinosi za mirovinsko osiguranje","3131",0,0,"-"]
[3132,"Doprinosi za obvezno zdravstveno osiguranje","3132",7014.19,7666.13,109.2945871155472]
[3133,"Doprinosi za obvezno osiguranje u slučaju nezaposlenosti","3133",0,0,"-"]
[32,"Materijalni rashodi (šifre 321+322+323+324+329)","32",{"$f":"D164+D169+D177+D187+D188","v":23871.49},29284.79,122.67684170531459]
[321,"Naknade troškova zaposlenima (šifre 3211 do 3214)","321",{"$f":"SUM(D165:D168)","v":2283.9100000000003},4141.75,181.34471148162578]
[3211,"Službena putovanja","3211",505.42,2188.65,433.03589094218671]
[3212,"Naknade za prijevoz, za rad na terenu i odvojeni život","3212",1639.13,1815.6,110.76607712628039]
[3213,"Stručno usavršavanje zaposlenika","3213",139.36000000000001,137.5,98.665327210103314]
[3214,"Ostale naknade troškova zaposlenima","3214",0,0,"-"]
[322,"Rashodi za materijal i energiju (šifre 3221 do 3227)","322",{"$f":"SUM(D170:D176)","v":6432},5750.23,89.400342039800989]
[3221,"Uredski materijal i ostali materijalni rashodi","3221",2668.93,2538.23,95.102906408186058]
[3222,"Materijal i sirovine","3222",0,0,"-"]
[3223,"Energija","3223",3658.83,3062.02,83.688501515511788]
[3224,"Materijal i dijelovi za tekuće i investicijsko održavanje","3224",0,0,"-"]
[3225,"Sitni inventar i auto gume","3225",104.24,149.97999999999999,143.87950882578664]
[3226,"Vojna sredstva za jednokratnu upotrebu","3226",0,0,"-"]
[3227,"Službena, radna i zaštitna odjeća i obuća","3227",0,0,"-"]
[323,"Rashodi za usluge (šifre 3231 do 3239)","323",{"$f":"SUM(D178:D186)","v":12956.61},17095.23,131.94215153500798]
[3231,"Usluge telefona, pošte i prijevoza","3231",530.24,616.73,116.31148159324081]
[3232,"Usluge tekućeg i investicijskog održavanja","3232",2405.59,2586.9,107.53702833816237]
[3233,"Usluge promidžbe i informiranja","3233",2013.52,320,15.892566252135564]
[3234,"Komunalne usluge","3234",585,482.66,82.505982905982904]
[3235,"Zakupnine i najamnine","3235",null,727.92,"-"]
[3236,"Zdravstvene i veterinarske usluge","3236",0,0,"-"]
[3237,"Intelektualne i osobne usluge","3237",3522.57,8599.98,244.13936415741912]
[3238,"Računalne usluge","3238",2285.4899999999998,2595.5,113.56426849384597]
[3239,"Ostale usluge","3239",1614.2,1165.54,72.205426836823193]
[324,"Naknade troškova osobama izvan radnog odnosa","324",0,0,"-"]
[329,"Ostali nespomenuti rashodi poslovanja (šifre 3291 do 3299)","329",{"$f":"SUM(D189:D195)","v":2198.9700000000003},2297.58,104.48437222881621]
[3291,"Naknade za rad predstavničkih i izvršnih tijela, povjerenstava i slično","3291",0,0,"-"]
[3292,"Premije osiguranja","3292",1534.69,1779.55,115.95501371612507]
[3293,"Reprezentacija","3293",664.28,518.03,77.983681580056597]
[3294,"Članarine i norme","3294",0,0,"-"]
[3295,"Pristojbe i naknade","3295",0,0,"-"]
["3296","Troškovi sudskih postupaka","3296",0,0,"-"]
[3299,"Ostali nespomenuti rashodi poslovanja ","3299",0,0,"-"]
[34,"Financijski rashodi (šifre 341+342+343) ","34",{"$f":"D197+D202+D210","v":0},0,"-"]
[341,"Kamate za izdane vrijednosne papire (šifre 3411 do 3419)","341",{"$f":"SUM(D198:D201)","v":0},0,"-"]
[3411,"Kamate za izdane trezorske zapise","3411",0,0,"-"]
[3412,"Kamate za izdane mjenice","3412",0,0,"-"]
[3413,"Kamate za izdane obveznice","3413",0,0,"-"]
[3419,"Kamate za ostale vrijednosne papire","3419",0,0,"-"]
[342,"Kamate za primljene kredite i zajmove (šifre 3421 do 3428)","342",{"$f":"SUM(D203:D209)","v":0},0,"-"]
[3421,"Kamate za primljene kredite i zajmove od međunarodnih organizacija, institucija i tijela EU te inozemnih vlada","3421",0,0,"-"]
[3422,"Kamate za primljene kredite i zajmove od kreditnih i ostalih financijskih institucija u javnom sektoru","3422",0,0,"-"]
[3423,"Kamate za primljene kredite i zajmove od kreditnih i ostalih financijskih institucija izvan javnog sektora","3423",0,0,"-"]
[3425,"Kamate za odobrene, a nerealizirane kredite i zajmove","3425",0,0,"-"]
[3426,"Kamate za primljene zajmove od trgovačkih društava u javnom sektoru","3426",0,0,"-"]
[3427,"Kamate za primljene zajmove od trgovačkih društava i obrtnika izvan javnog sektora","3427",0,0,"-"]
[3428,"Kamate za primljene zajmove od drugih razina vlasti","3428",0,0,"-"]
[343,"Ostali financijski rashodi (šifre 3431 do 3434)","343",{"$f":"SUM(D211:D214)","v":0},0,"-"]
[3431,"Bankarske usluge i usluge platnog prometa","3431",0,0,"-"]
[3432,"Negativne tečajne razlike i razlike zbog primjene valutne klauzule","3432",0,0,"-"]
[3433,"Zatezne kamate ","3433",0,0,"-"]
[3434,"Ostali nespomenuti financijski rashodi","3434",0,0,"-"]
[35,"Subvencije (šifre 351+352+353)","35",{"$f":"D216+D219+D223","v":0},0,"-"]
[351,"Subvencije trgovačkim društvima u javnom sektoru (šifre 3511+3512)","351",{"$f":"SUM(D217:D218)","v":0},0,"-"]
[3511,"Subvencije kreditnim i ostalim financijskim institucijama u javnom sektoru","3511",0,0,"-"]
[3512,"Subvencije trgovačkim društvima u javnom sektoru","3512",0,0,"-"]
[352,"Subvencije trgovačkim društvima, zadrugama, poljoprivrednicima i obrtnicima izvan javnog sektora (šifre 3521 do 3523)","352",{"$f":"SUM(D220:D222)","v":0},0,"-"]
[3521,"Subvencije kreditnim i ostalim financijskim institucijama izvan javnog sektora","3521",0,0,"-"]
[3522,"Subvencije trgovačkim društvima i zadrugama izvan javnog sektora","3522",0,0,"-"]
[3523,"Subvencije poljoprivrednicima i obrtnicima","3523",0,0,"-"]
["353","Subvencije trgovačkim društvima, zadrugama, poljoprivrednicima i obrtnicima iz EU sredstava ","353",0,0,"-"]
[36,"Pomoći dane u inozemstvo i unutar općeg proračuna (šifre 361+362+363+366+367+368+369)","36",{"$f":"D225+D228+D231+D236+D240+D244+D247","v":0},0,{"$f":"IF(D224<>0,IF(E224/D224>=100,\">>100\",E224/D224*100),\"-\")","v":"-"}]
[361,"Pomoći inozemnim vladama (šifre 3611+3612)","361",{"$f":"SUM(D226:D227)","v":0},0,"-"]
[3611,"Tekuće pomoći inozemnim vladama","3611",0,0,"-"]
[3612,"Kapitalne pomoći inozemnim vladama","3612",0,0,"-"]
[362,"Pomoći međunarodnim organizacijama te institucijama i tijelima EU (šifre 3621+3622)","362",{"$f":"SUM(D229:D230)","v":0},0,"-"]
[3621,"Tekuće pomoći međunarodnim organizacijama te institucijama i tijelima EU","3621",0,0,"-"]
[3622,"Kapitalne pomoći međunarodnim organizacijama te institucijama i tijelima EU","3622",0,0,"-"]
[363,"Pomoći unutar općeg proračuna (šifre 3631 do 3636)","363",{"$f":"SUM(D232:D235)","v":0},0,"-"]
[3631,"Tekuće pomoći unutar općeg proračuna","3631",0,0,"-"]
[3632,"Kapitalne pomoći unutar općeg proračuna ","3632",0,0,"-"]
["3635","Pomoći unutar općeg proračuna po protestiranim jamstvima","3635",0,0,"-"]
["3636","Povrat pomoći primljenih unutar općeg proračuna po protestiranim jamstvima","3636",0,0,"-"]
["366","Pomoći proračunskim korisnicima drugih proračuna (šifre 3661 do 3663)","366",{"$f":"SUM(D237:D239)","v":0},0,{"$f":"IF(D236<>0,IF(E236/D236>=100,\">>100\",E236/D236*100),\"-\")","v":"-"}]
["3661","Tekuće pomoći proračunskim korisnicima drugih proračuna","3661",0,0,"-"]
["3662","Kapitalne pomoći proračunskim korisnicima drugih proračuna","3662",0,0,"-"]
["3663","Pomoći proračunskim korisnicima po protestiranim jamstvima","3663",0,0,"-"]
["367","Prijenosi proračunskim korisnicima iz nadležnog proračuna za financiranje redovne djelatnosti (šifre 3672 do 3674)","367",{"$f":"SUM(D241:D243)","v":0},0,{"$f":"IF(D240<>0,IF(E240/D240>=100,\">>100\",E240/D240*100),\"-\")","v":"-"}]
[3672,"Prijenosi proračunskim korisnicima iz nadležnog proračuna za financiranje rashoda poslovanja","3672",0,0,"-"]
[3673,"Prijenosi proračunskim korisnicima iz nadležnog proračuna za nabavu nefinancijske imovine","3673",0,0,"-"]
[3674,"Prijenosi proračunskim korisnicima iz nadležnog proračuna za financijsku imovinu i otplatu zajmova","3674",0,0,"-"]
["368","Pomoći temeljem prijenosa EU sredstava (šifre 3681+3682)","368",{"$f":"SUM(D245:D246)","v":0},0,{"$f":"IF(D244<>0,IF(E244/D244>=100,\">>100\",E244/D244*100),\"-\")","v":"-"}]
["3681","Tekuće pomoći temeljem prijenosa EU sredstava","3681",0,0,"-"]
["3682","Kapitalne pomoći temeljem prijenosa EU sredstava","3682",0,0,"-"]
["369","Prijenosi između proračunskih korisnika istog proračuna (šifre 3691 do 3694)","369",{"$f":"SUM(D248:D251)","v":0},0,"-"]
["3691","Tekući prijenosi između proračunskih korisnika istog proračuna","3691",0,0,"-"]
["3692","Kapitalni prijenosi između proračunskih korisnika istog proračuna","3692",0,0,"-"]
["3693","Tekući prijenosi između proračunskih korisnika istog proračuna temeljem prijenosa EU sredstava","3693",0,0,"-"]
["3694","Kapitalni prijenosi između proračunskih korisnika istog proračuna temeljem prijenosa EU sredstava","3694",0,0,"-"]
[37,"Naknade građanima i kućanstvima na temelju osiguranja i druge naknade (šifre 371+372)","37",{"$f":"D253+D259","v":0},0,{"$f":"IF(D252<>0,IF(E252/D252>=100,\">>100\",E252/D252*100),\"-\")","v":"-"}]
[371,"Naknade građanima i kućanstvima na temelju osiguranja (šifre 3711 do 3715)","371",{"$f":"SUM(D254:D258)","v":0},0,"-"]
[3711,"Naknade građanima i kućanstvima u novcu - neposredno ili putem ustanova izvan javnog sektora","3711",0,0,"-"]
[3712,"Naknade građanima i kućanstvima u naravi - neposredno ili putem ustanova izvan javnog sektora","3712",0,0,"-"]
["3713","Naknade građanima i kućanstvima u novcu - putem ustanova u javnom sektoru","3713",0,0,"-"]
["3714","Naknade građanima i kućanstvima u naravi - putem ustanova u javnom sektoru","3714",0,0,"-"]
["3715","Naknade građanima i kućanstvima na temelju osiguranja iz EU sredstava","3715",0,0,"-"]
[372,"Ostale naknade građanima i kućanstvima iz proračuna (šifre 3721 do 3723) ","372",{"$f":"SUM(D260:D262)","v":0},0,{"$f":"IF(D259<>0,IF(E259/D259>=100,\">>100\",E259/D259*100),\"-\")","v":"-"}]
[3721,"Naknade građanima i kućanstvima u novcu ","3721",0,0,"-"]
[3722,"Naknade građanima i kućanstvima u naravi","3722",0,0,"-"]
["3723","Naknade građanima i kućanstvima iz EU sredstava","3723",0,0,"-"]
[38,"Ostali rashodi (šifre 381+382+383+386)","38",{"$f":"D264+D268+D273+D279","v":0},0,{"$f":"IF(D263<>0,IF(E263/D263>=100,\">>100\",E263/D263*100),\"-\")","v":"-"}]
[381,"Tekuće donacije (šifre 3811 do 3813) ","381",{"$f":"SUM(D265:D267)","v":0},0,"-"]
[3811,"Tekuće donacije u novcu","3811",0,0,"-"]
[3812,"Tekuće donacije u naravi","3812",0,0,"-"]
["3813","Tekuće donacije iz EU sredstava","3813",0,0,"-"]
[382,"Kapitalne donacije (šifre 3821 do 3824) ","382",{"$f":"SUM(D269:D272)","v":0},0,{"$f":"IF(D268<>0,IF(E268/D268>=100,\">>100\",E268/D268*100),\"-\")","v":"-"}]
[3821,"Kapitalne donacije neprofitnim organizacijama","3821",0,0,"-"]
[3822,"Kapitalne donacije građanima i kućanstvima","3822",0,0,"-"]
["3823","Kapitalne donacije iz EU sredstava","3823",0,0,"-"]
["3824","Donacije neprofitnim organizacijama, građanima i kućanstvima u tuzemstvu po protestiranim jamstvima","3824",0,0,"-"]
[383,"Kazne, penali i naknade štete (šifre 3831 do 3835)","383",{"$f":"SUM(D274:D278)","v":0},0,{"$f":"IF(D273<>0,IF(E273/D273>=100,\">>100\",E273/D273*100),\"-\")","v":"-"}]
[3831,"Naknade šteta pravnim i fizičkim osobama","3831",0,0,"-"]
[3832,"Penali, ležarine i drugo","3832",0,0,"-"]
[3833,"Naknade šteta zaposlenicima ","3833",0,0,"-"]
[3834,"Ugovorene kazne i ostale naknade šteta","3834",0,0,"-"]
["3835","Ostale kazne","3835",0,0,"-"]
[386,"Kapitalne pomoći (šifre 3861 do 3865)","386",{"$f":"SUM(D280:D284)","v":0},0,"-"]
[3861,"Kapitalne pomoći kreditnim i ostalim financijskim institucijama te trgovačkim društvima u javnom sektoru","3861",0,0,"-"]
[3862,"Kapitalne pomoći kreditnim i ostalim financijskim institucijama te trgovačkim društvima izvan javnog sektora","3862",0,0,"-"]
[3863,"Kapitalne pomoći poljoprivrednicima i obrtnicima","3863",0,0,"-"]
["3864","Kapitalne pomoći iz EU sredstava ","3864",0,0,"-"]
["3865","Kapitalne pomoći trgovačkim društvima i obrtnicima po protestiranim jamstvima","3865",0,0,"-"]
[" ","Stanje zaliha proizvodnje i gotovih proizvoda na početku razdoblja","Z001",0,0,{"$f":"IF(D285<>0,IF(E285/D285>=100,\">>100\",E285/D285*100),\"-\")","v":"-"}]
[" ","Stanje zaliha proizvodnje i gotovih proizvoda na kraju razdoblja ","Z002",0,0,"-"]
[" ","Povećanje zaliha proizvodnje i gotovih proizvoda (šifre Z002-Z001)","Z003",{"$f":"IF(D286>=D285,D286-D285,0)","v":0},0,"-"]
[" ","Smanjenje zaliha proizvodnje i gotovih proizvoda (šifre Z001-Z002) ","Z004",{"$f":"IF(D285>=D286,D285-D286,0)","v":0},0,"-"]
[" ","Ukupni rashodi poslovanja (šifre 3-Z003+Z004)","Z005",{"$f":"D151-D287+D288","v":77222.87000000001},87498.09,113.3059286711307]
[" ","VIŠAK PRIHODA POSLOVANJA (šifre 6-Z005) ","X001",{"$f":"IF(D6>=D289,D6-D289,0)","v":18666.259999999995},{"$f":"IF(E6>=E289,E6-E289,0)","v":24686.020000000004},132.24941686229599]
[" ","MANJAK PRIHODA POSLOVANJA (šifre Z005-6)","Y001",{"$f":"IF(D289>=D6,D289-D6,0)","v":0},{"$f":"IF(E289>=E6,E289-E6,0)","v":0},"-"]
[92211,"Višak prihoda poslovanja - preneseni","92211",5118.34,6527.57,127.53295013617696]
[92221,"Manjak prihoda poslovanja - preneseni","92221",0,0,"-"]
[96,"Obračunati prihodi poslovanja - nenaplaćeni","96",36.5,7.3,20]
[9661,"Obračunati prihodi od prodaje proizvoda i robe i pruženih usluga - nenaplaćeni","9661",36.5,7.3,20]
["9673","Obračunati prihodi od HZZO-a na temelju ugovornih obveza","9673",0,0,"-"]
["Prihodi i rashodi od nefinancijske imovine"]
[7,"Prihodi od prodaje nefinancijske imovine (šifre 71+72+73+74)","7",{"$f":"D299+D311+D344+D348","v":0},0,{"$f":"IF(D298<>0,IF(E298/D298>=100,\">>100\",E298/D298*100),\"-\")","v":"-"}]
[71,"Prihodi od prodaje neproizvedene dugotrajne imovine (šifre 711+712)","71",{"$f":"D300+D304","v":0},0,"-"]
[711,"Prihodi od prodaje materijalne imovine - prirodnih bogatstava (šifre 7111 do 7113)","711",{"$f":"SUM(D301:D303)","v":0},0,"-"]
[7111,"Zemljište","7111",0,0,"-"]
[7112,"Rudna bogatstva","7112",0,0,"-"]
[7113,"Prihodi od prodaje ostale prirodne materijalne imovine","7113",0,0,"-"]
[712,"Prihodi od prodaje nematerijalne imovine (šifre 7121 do 7126)","712",{"$f":"SUM(D305:D310)","v":0},0,"-"]
[7121,"Patenti","7121",0,0,"-"]
[7122,"Koncesije","7122",0,0,"-"]
[7123,"Licence","7123",0,0,"-"]
[7124,"Ostala prava","7124",0,0,"-"]
[7125,"Goodwill","7125",0,0,"-"]
[7126,"Ostala nematerijalna imovina","7126",0,0,"-"]
[72,"Prihodi od prodaje proizvedene dugotrajne imovine (šifre 721+722+723+724+725+726)","72",{"$f":"D312+D317+D326+D331+D336+D339","v":0},0,"-"]
[721,"Prihodi od prodaje građevinskih objekata (šifre 7211 do 7214)","721",{"$f":"SUM(D313:D316)","v":0},0,"-"]
[7211,"Stambeni objekti","7211",0,0,"-"]
[7212,"Poslovni objekti","7212",0,0,"-"]
[7213,"Ceste, željeznice i ostali prometni objekti","7213",0,0,"-"]
[7214,"Ostali građevinski objekti","7214",0,0,"-"]
[722,"Prihodi od prodaje postrojenja i opreme (šifre 7221 do 7228)","722",{"$f":"SUM(D318:D325)","v":0},0,"-"]
[7221,"Uredska oprema i namještaj","7221",0,0,"-"]
[7222,"Komunikacijska oprema ","7222",0,0,"-"]
[7223,"Oprema za održavanje i zaštitu","7223",0,0,"-"]
[7224,"Medicinska i laboratorijska oprema","7224",0,0,"-"]
[7225,"Instrumenti, uređaji i strojevi ","7225",0,0,"-"]
[7226,"Sportska i glazbena oprema","7226",0,0,"-"]
[7227,"Uređaji, strojevi i oprema za ostale namjene","7227",0,0,"-"]
["7228","Vojna oprema","7228",0,0,"-"]
[723,"Prihodi od prodaje prijevoznih sredstava (šifre 7231 do 7234)","723",{"$f":"SUM(D327:D330)","v":0},0,"-"]
[7231,"Prijevozna sredstva u cestovnom prometu","7231",0,0,"-"]
[7232,"Prijevozna sredstva u željezničkom prometu","7232",0,0,"-"]
[7233,"Prijevozna sredstva u pomorskom i riječnom prometu","7233",0,0,"-"]
[7234,"Prijevozna sredstva u zračnom prometu","7234",0,0,"-"]
[724,"Prihodi od prodaje knjiga, umjetničkih djela i ostalih izložbenih vrijednosti (šifre 7241 do 7244)","724",{"$f":"SUM(D332:D335)","v":0},0,"-"]
[7241,"Knjige","7241",0,0,"-"]
[7242,"Umjetnička djela (izložena u galerijama, muzejima i slično)","7242",0,0,"-"]
[7243,"Muzejski izlošci i predmeti prirodnih rijetkosti","7243",0,0,"-"]
[7244,"Ostale nespomenute izložbene vrijednosti","7244",0,0,"-"]
[725,"Prihodi od prodaje višegodišnjih nasada i osnovnog stada (šifre 7251+7252)","725",{"$f":"SUM(D337:D338)","v":0},0,"-"]
[7251,"Višegodišnji nasadi","7251",0,0,"-"]
[7252,"Osnovno stado","7252",0,0,"-"]
[726,"Prihodi od prodaje nematerijalne proizvedene imovine (šifre 7261 do 7264)","726",{"$f":"SUM(D340:D343)","v":0},0,"-"]
[7261,"Istraživanje rudnih bogatstava","7261",0,0,"-"]
[7262,"Ulaganja u računalne programe ","7262",0,0,"-"]
[7263,"Umjetnička, literarna i znanstvena djela","7263",0,0,"-"]
[7264,"Ostala nematerijalna proizvedena imovina","7264",0,0,"-"]
[73,"Prihodi od prodaje plemenitih metala i ostalih pohranjenih vrijednosti (šifra 731)","73",{"$f":"D345","v":0},0,"-"]
[731,"Prihodi od prodaje plemenitih metala i ostalih pohranjenih vrijednosti (šifre 7311+7312)","731",{"$f":"SUM(D346:D347)","v":0},0,"-"]
[7311,"Plemeniti metali i drago kamenje","7311",0,0,"-"]
[7312,"Pohranjene knjige, umjetnička djela i slične vrijednosti","7312",0,0,"-"]
[74,"Prihodi od prodaje proizvedene kratkotrajne imovine (šifra 741)","74",{"$f":"D349","v":0},0,"-"]
[741,"Prihodi od prodaje zaliha","741",0,0,"-"]
[4,"Rashodi za nabavu nefinancijske imovine (šifre 41+42+43+44+45)","4",{"$f":"D351+D363+D396+D400+D402","v":17154.670000000002},25779.4,150.27628045307779]
[41,"Rashodi za nabavu neproizvedene dugotrajne imovine (šifre 411+412)","41",{"$f":"D352+D356","v":0},0,"-"]
[411,"Materijalna imovina - prirodna bogatstva (šifre 4111 do 4113)","411",{"$f":"SUM(D353:D355)","v":0},0,"-"]
[4111,"Zemljište","4111",0,0,"-"]
[4112,"Rudna bogatstva","4112",0,0,"-"]
[4113,"Ostala prirodna materijalna imovina","4113",0,0,"-"]
[412,"Nematerijalna imovina (šifre 4121 do 4126)","412",{"$f":"SUM(D357:D362)","v":0},0,"-"]
[4121,"Patenti","4121",0,0,"-"]
[4122,"Koncesije","4122",0,0,"-"]
[4123,"Licence","4123",0,0,"-"]
[4124,"Ostala prava","4124",0,0,"-"]
[4125,"Goodwill","4125",0,0,"-"]
[4126,"Ostala nematerijalna imovina","4126",0,0,"-"]
[42,"Rashodi za nabavu proizvedene dugotrajne imovine (šifre 421+422+423+424+425+426)","42",{"$f":"D364+D369+D378+D383+D388+D391","v":17154.670000000002},25779.4,150.27628045307779]
[421,"Građevinski objekti (šifre 4211 do 4214)","421",{"$f":"SUM(D365:D368)","v":0},0,"-"]
[4211,"Stambeni objekti","4211",0,0,"-"]
[4212,"Poslovni objekti","4212",0,0,"-"]
[4213,"Ceste, željeznice i ostali prometni objekti","4213",0,0,"-"]
[4214,"Ostali građevinski objekti","4214",0,0,"-"]
[422,"Postrojenja i oprema (šifre 4221 do 4228)","422",{"$f":"SUM(D370:D377)","v":888.51},797.98,89.811031952369703]
[4221,"Uredska oprema i namještaj","4221",888.51,797.98,89.811031952369703]
[4222,"Komunikacijska oprema","4222",0,0,"-"]
[4223,"Oprema za održavanje i zaštitu","4223",0,0,"-"]
[4224,"Medicinska i laboratorijska oprema","4224",0,0,"-"]
[4225,"Instrumenti, uređaji i strojevi ","4225",0,0,"-"]
[4226,"Sportska i glazbena oprema","4226",0,0,"-"]
[4227,"Uređaji, strojevi i oprema za ostale namjene","4227",0,0,"-"]
["4228","Vojna oprema","4228",0,0,"-"]
[423,"Prijevozna sredstva (šifre 4231 do 4234)","423",{"$f":"SUM(D379:D382)","v":0},0,"-"]
[4231,"Prijevozna sredstva u cestovnom prometu","4231",0,0,"-"]
[4232,"Prijevozna sredstva u željezničkom prometu","4232",0,0,"-"]
[4233,"Prijevozna sredstva u pomorskom i riječnom prometu","4233",0,0,"-"]
[4234,"Prijevozna sredstva u zračnom prometu","4234",0,0,"-"]
[424,"Knjige, umjetnička djela i ostale izložbene vrijednosti (šifre 4241 do 4244)","424",{"$f":"SUM(D384:D387)","v":13940.87},23994.31,172.11486801038959]
[4241,"Knjige ","4241",13940.87,23994.31,172.11486801038959]
[4242,"Umjetnička djela (izložena u galerijama, muzejima i slično)","4242",0,0,"-"]
[4243,"Muzejski izlošci i predmeti prirodnih rijetkosti","4243",0,0,"-"]
[4244,"Ostale nespomenute izložbene vrijednosti","4244",0,0,"-"]
[425,"Višegodišnji nasadi i osnovno stado (šifre 4251+4252)","425",{"$f":"SUM(D389:D390)","v":0},0,"-"]
[4251,"Višegodišnji nasadi ","4251",0,0,"-"]
[4252,"Osnovno stado","4252",0,0,"-"]
[426,"Nematerijalna proizvedena imovina (šifre 4261 do 4264)","426",{"$f":"SUM(D392:D395)","v":2325.29},987.11,42.451049116454293]
[4261,"Istraživanje rudnih bogatstava","4261",0,0,"-"]
[4262,"Ulaganja u računalne programe ","4262",995.42,null,0]
[4263,"Umjetnička, literarna i znanstvena djela","4263",1329.87,987.11,74.226052170512915]
[4264,"Ostala nematerijalna proizvedena imovina","4264",0,0,"-"]
[43,"Rashodi za nabavu plemenitih metala i ostalih pohranjenih vrijednosti (šifra 431)","43",{"$f":"D397","v":0},0,"-"]
[431,"Plemeniti metali i ostale pohranjene vrijednosti (šifre 4311+4312)","431",{"$f":"SUM(D398:D399)","v":0},0,"-"]
[4311,"Plemeniti metali i drago kamenje","4311",0,0,"-"]
[4312,"Pohranjene knjige, umjetnička djela i slične vrijednosti","4312",0,0,"-"]
[44,"Rashodi za nabavu proizvedene kratkotrajne imovine (šifra 441)","44",{"$f":"D401","v":0},0,"-"]
[441,"Rashodi za nabavu zaliha","441",0,0,"-"]
[45,"Rashodi za dodatna ulaganja na nefinancijskoj imovini (šifre 451 do 454)","45",{"$f":"SUM(D403:D406)","v":0},0,"-"]
[451,"Dodatna ulaganja na građevinskim objektima","451",0,0,"-"]
[452,"Dodatna ulaganja na postrojenjima i opremi","452",0,0,"-"]
[453,"Dodatna ulaganja na prijevoznim sredstvima","453",0,0,"-"]
[454,"Dodatna ulaganja za ostalu nefinancijsku imovinu","454",0,0,"-"]
[" ","VIŠAK PRIHODA OD NEFINANCIJSKE IMOVINE (šifre 7-4)","X002",{"$f":"IF(D298>=D350,D298-D350,0)","v":0},0,"-"]
[" ","MANJAK PRIHODA OD NEFINANCIJSKE IMOVINE (šifre 4-7)","Y002",{"$f":"IF(D350>=D298,D350-D298,0)","v":17154.670000000002},25779.4,150.27628045307779]
[92212,"Višak prihoda od nefinancijske imovine - preneseni ","92212",0,102.36,"-"]
[92222,"Manjak prihoda od nefinancijske imovine - preneseni ","92222",0,0,"-"]
[97,"Obračunati prihodi od prodaje nefinancijske imovine - nenaplaćeni","97",0,0,"-"]
[" ","UKUPNI PRIHODI (šifre 6+7)","X067",{"$f":"D6+D298","v":95889.13},{"$f":"E6+E298","v":112184.11},116.99356329544339]
[" ","UKUPNI RASHODI (šifre Z005+4)","Y034",{"$f":"D289+D350","v":94377.540000000008},113277.48999999999,120.02589811092766]
[" ","UKUPAN VIŠAK PRIHODA (šifre X067-Y034)","X004",{"$f":"IF(D412>=D413,D412-D413,0)","v":1511.5899999999965},0,0]
[" ","UKUPAN MANJAK PRIHODA (šifre Y034-X067)","Y004",{"$f":"IF(D413>=D412,D413-D412,0)","v":0},1093.3799999999901,"-"]
["9221x, 9222x","Višak prihoda - preneseni (šifre 92211+92212-92221-92222)","9221x,9222x VP",{"$f":"IF(D292-D293+D409-D410>=0,D292-D293+D409-D410,0)","v":5118.34},6629.9299999999994,129.53281728060267]
["9221x, 9222x","Manjak prihoda - preneseni (šifre 92221+92222-92211-92212)","9221x,9222x MP",{"$f":"IF(D293-D292+D410-D409>=0,D293-D292+D410-D409,0)","v":0},0,"-"]
["96, 97","Obračunati prihodi - nenaplaćeni (šifre 96+97)","96,97",{"$f":"D294+D411","v":36.5},7.3,20]
["Primici i izdaci"]
[8,"Primici od financijske imovine i zaduživanja (šifre 81+82+83+84+85)","8",{"$f":"D421+D459+D472+D484+D515","v":0},0,{"$f":"IF(D420<>0,IF(E420/D420>=100,\">>100\",E420/D420*100),\"-\")","v":"-"}]
[81,"Primljeni povrati glavnica danih zajmova i depozita (šifre 811+812+813+814+815+816+817+818)","81",{"$f":"D422+D427+D430+D434+D435+D442+D447+D455","v":0},0,"-"]
[811,"Primici (povrati) glavnice zajmova danih međunarodnim organizacijama, institucijama i tijelima EU te inozemnim vladama (šifre 8113 do 8116)","811",{"$f":"SUM(D423:D426)","v":0},0,"-"]
[8113,"Povrat zajmova danih međunarodnim organizacijama","8113",0,0,"-"]
[8114,"Povrat zajmova danih institucijama i tijelima EU","8114",0,0,"-"]
[8115,"Povrat zajmova danih inozemnim vladama u EU","8115",0,0,"-"]
[8116,"Povrat zajmova danih inozemnim vladama izvan EU","8116",0,0,"-"]
[812,"Primici (povrati) glavnice zajmova danih neprofitnim organizacijama, građanima i kućanstvima (šifre 8121+8122)","812",{"$f":"SUM(D428:D429)","v":0},0,"-"]
[8121,"Povrat zajmova danih neprofitnim organizacijama, građanima i kućanstvima u tuzemstvu","8121",0,0,"-"]
[8122,"Povrat zajmova danih neprofitnim organizacijama, građanima i kućanstvima u inozemstvu","8122",0,0,"-"]
[813,"Primici (povrati) glavnice zajmova danih kreditnim i ostalim financijskim institucijama u javnom sektoru (šifre 8132 do 8134)","813",{"$f":"SUM(D431:D433)","v":0},0,"-"]
[8132,"Povrat zajmova danih kreditnim institucijama u javnom sektoru","8132",0,0,"-"]
[8133,"Povrat zajmova danih osiguravajućim društvima u javnom sektoru","8133",0,0,"-"]
[8134,"Povrat zajmova danih ostalim financijskim institucijama u javnom sektoru","8134",0,0,"-"]
[814,"Primici (povrati) glavnice zajmova danih trgovačkim društvima u javnom sektoru","814",0,0,"-"]
[815,"Primici (povrati) glavnice zajmova danih kreditnim i ostalim financijskim institucijama izvan javnog sektora (šifre 8153 do 8158)","815",{"$f":"SUM(D436:D441)","v":0},0,"-"]
[8153,"Povrat zajmova danih tuzemnim kreditnim institucijama izvan javnog sektora","8153",0,0,"-"]
[8154,"Povrat zajmova danih tuzemnim osiguravajućim društvima izvan javnog sektora","8154",0,0,"-"]
[8155,"Povrat zajmova danih ostalim tuzemnim financijskim institucijama izvan javnog sektora","8155",0,0,"-"]
[8156,"Povrat zajmova danih inozemnim kreditnim institucijama","8156",0,0,"-"]
[8157,"Povrat zajmova danih inozemnim osiguravajućim društvima","8157",0,0,"-"]
[8158,"Povrat zajmova danih ostalim inozemnim financijskim institucijama","8158",0,0,"-"]
[816,"Primici (povrati) glavnice zajmova danih trgovačkim društvima i obrtnicima izvan javnog sektora (šifre 8163 do 8166)","816",{"$f":"SUM(D443:D446)","v":0},0,"-"]
[8163,"Povrat zajmova danih tuzemnim trgovačkim društvima izvan javnog sektora","8163",0,0,"-"]
[8164,"Povrat zajmova danih tuzemnim obrtnicima","8164",0,0,"-"]
[8165,"Povrat zajmova danih inozemnim trgovačkim društvima","8165",0,0,"-"]
[8166,"Povrat zajmova danih inozemnim obrtnicima","8166",0,0,"-"]
[817,"Povrat zajmova danih drugim razinama vlasti (šifre 8171 do 8177)","817",{"$f":"SUM(D448:D454)","v":0},0,"-"]
[8171,"Povrat zajmova danih državnom proračunu","8171",0,0,"-"]
[8172,"Povrat zajmova danih županijskim proračunima","8172",0,0,"-"]
[8173,"Povrat zajmova danih gradskim proračunima","8173",0,0,"-"]
[8174,"Povrat zajmova danih općinskim proračunima","8174",0,0,"-"]
[8175,"Povrat zajmova danih HZMO-u, HZZ-u i HZZO-u","8175",0,0,"-"]
[8176,"Povrat zajmova danih ostalim izvanproračunskim korisnicima državnog proračuna","8176",0,0,"-"]
[8177,"Povrat zajmova danih izvanproračunskim korisnicima županijskih, gradskih i općinskih proračuna","8177",0,0,"-"]
["818","Primici od povrata depozita i jamčevnih pologa (šifre 8181 do 8183)","818",{"$f":"SUM(D456:D458)","v":0},0,"-"]
["8181","Primici od povrata depozita od kreditnih i ostalih financijskih institucija - tuzemni","8181",0,0,"-"]
["8182","Primici od povrata depozita od kreditnih i ostalih financijskih institucija - inozemni","8182",0,0,"-"]
["8183","Primici od povrata jamčevnih pologa","8183",0,0,"-"]
[82,"Primici od izdanih vrijednosnih papira (šifre 821+822+823+824)","82",{"$f":"D460+D463+D466+D469","v":0},0,"-"]
[821,"Trezorski zapisi (šifre 8211+8212)","821",{"$f":"SUM(D461:D462)","v":0},0,"-"]
[8211,"Trezorski zapisi - tuzemni","8211",0,0,"-"]
[8212,"Trezorski zapisi - inozemni","8212",0,0,"-"]
[822,"Obveznice (šifre 8221+8222)","822",{"$f":"SUM(D464:D465)","v":0},0,"-"]
[8221,"Obveznice - tuzemne","8221",0,0,"-"]
[8222,"Obveznice - inozemne","8222",0,0,"-"]
[823,"Opcije i drugi financijski derivati (šifre 8231+8232)","823",{"$f":"SUM(D467:D468)","v":0},0,"-"]
[8231,"Opcije i drugi financijski derivati - tuzemni","8231",0,0,"-"]
[8232,"Opcije i drugi financijski derivati - inozemni","8232",0,0,"-"]
[824,"Ostali vrijednosni papiri (šifre 8241+8242)","824",{"$f":"SUM(D470:D471)","v":0},0,"-"]
[8241,"Ostali vrijednosni papiri - tuzemni","8241",0,0,"-"]
[8242,"Ostali vrijednosni papiri - inozemni","8242",0,0,"-"]
[83,"Primici od prodaje dionica i udjela u glavnici (šifre 831+832+833+834)","83",{"$f":"D473+D477+D478+D481","v":0},0,"-"]
[831,"Primici od prodaje dionica i udjela u glavnici kreditnih i ostalih financijskih institucija u javnom sektoru (šifre 8312 do 8314)","831",{"$f":"SUM(D474:D476)","v":0},0,"-"]
[8312,"Dionice i udjeli u glavnici kreditnih institucija u javnom sektoru","8312",0,0,"-"]
[8313,"Dionice i udjeli u glavnici osiguravajućih društava u javnom sektoru","8313",0,0,"-"]
[8314,"Dionice i udjeli u glavnici ostalih financijskih institucija u javnom sektoru","8314",0,0,"-"]
[832,"Primici od prodaje dionica i udjela u glavnici trgovačkih društava u javnom sektoru","832",0,0,"-"]
[833,"Primici od prodaje dionica i udjela u glavnici kreditnih i ostalih financijskih institucija izvan javnog sektora (šifre 8331+8332)","833",{"$f":"SUM(D479:D480)","v":0},0,"-"]
[8331,"Dionice i udjeli u glavnici tuzemnih kreditnih i ostalih financijskih institucija izvan javnog sektora ","8331",0,0,"-"]
[8332,"Dionice i udjeli u glavnici inozemnih kreditnih i ostalih financijskih institucija ","8332",0,0,"-"]
[834,"Primici od prodaje dionica i udjela u glavnici trgovačkih društava izvan javnog sektora (šifre 8341+8342)","834",{"$f":"SUM(D482:D483)","v":0},0,"-"]
[8341,"Dionice i udjeli u glavnici tuzemnih trgovačkih društva izvan javnog sektora","8341",0,0,"-"]
[8342,"Dionice i udjeli u glavnici inozemnih trgovačkih društava","8342",0,0,"-"]
[84,"Primici od zaduživanja (šifre 841+842+843+844+845+847)","84",{"$f":"D485+D490+D494+D495+D502+D507","v":0},0,"-"]
[841,"Primljeni krediti i zajmovi od međunarodnih organizacija, institucija i tijela EU te inozemnih vlada (šifre 8413 do 8416)","841",{"$f":"SUM(D486:D489)","v":0},0,"-"]
[8413,"Primljeni zajmovi od međunarodnih organizacija","8413",0,0,"-"]
[8414,"Primljeni krediti i zajmovi od institucija i tijela EU","8414",0,0,"-"]
[8415,"Primljeni zajmovi od inozemnih vlada u EU","8415",0,0,"-"]
[8416,"Primljeni zajmovi od inozemnih vlada izvan EU","8416",0,0,"-"]
[842,"Primljeni krediti i zajmovi od kreditnih i ostalih financijskih institucija u javnom sektoru (šifre 8422 do 8424)","842",{"$f":"SUM(D491:D493)","v":0},0,"-"]
[8422,"Primljeni krediti od kreditnih institucija u javnom sektoru","8422",0,0,"-"]
[8423,"Primljeni zajmovi od osiguravajućih društava u javnom sektoru","8423",0,0,"-"]
[8424,"Primljeni zajmovi od ostalih financijskih institucija u javnom sektoru","8424",0,0,"-"]
[843,"Primljeni zajmovi od trgovačkih društava u javnom sektoru","843",0,0,"-"]
[844,"Primljeni krediti i zajmovi od kreditnih i ostalih financijskih institucija izvan javnog sektora (šifre 8443 do 8448)","844",{"$f":"SUM(D496:D501)","v":0},0,"-"]
[8443,"Primljeni krediti od tuzemnih kreditnih institucija izvan javnog sektora","8443",0,0,"-"]
[8444,"Primljeni zajmovi od tuzemnih osiguravajućih društava izvan javnog sektora","8444",0,0,"-"]
[8445,"Primljeni zajmovi od ostalih tuzemnih financijskih institucija izvan javnog sektora","8445",0,0,"-"]
[8446,"Primljeni krediti od inozemnih kreditnih institucija","8446",0,0,"-"]
[8447,"Primljeni zajmovi od inozemnih osiguravajućih društava","8447",0,0,"-"]
[8448,"Primljeni zajmovi od ostalih inozemnih financijskih institucija","8448",0,0,"-"]
[845,"Primljeni zajmovi od trgovačkih društava i obrtnika izvan javnog sektora (šifre 8453 do 8456)","845",{"$f":"SUM(D503:D506)","v":0},0,"-"]
[8453,"Primljeni zajmovi od tuzemnih trgovačkih društava izvan javnog sektora","8453",0,0,"-"]
[8454,"Primljeni zajmovi od tuzemnih obrtnika","8454",0,0,"-"]
[8455,"Primljeni zajmovi od inozemnih trgovačkih društava","8455",0,0,"-"]
[8456,"Primljeni zajmovi od inozemnih obrtnika","8456",0,0,"-"]
[847,"Primljeni zajmovi od drugih razina vlasti (šifre 8471 do 8477)","847",{"$f":"SUM(D508:D514)","v":0},0,"-"]
[8471,"Primljeni zajmovi od državnog proračuna","8471",0,0,"-"]
[8472,"Primljeni zajmovi od županijskih proračuna","8472",0,0,"-"]
[8473,"Primljeni zajmovi od gradskih proračuna","8473",0,0,"-"]
[8474,"Primljeni zajmovi od općinskih proračuna","8474",0,0,"-"]
[8475,"Primljeni zajmovi od HZMO-a, HZZ-a i HZZO-a","8475",0,0,"-"]
[8476,"Primljeni zajmovi od ostalih izvanproračunskih korisnika državnog proračuna","8476",0,0,"-"]
["8477","Primljeni zajmovi od izvanproračunskih korisnika županijskih, gradskih i općinskih proračuna","8477",0,0,"-"]
[85,"Primici od prodaje vrijednosnih papira iz portfelja (šifre 851+852+853+854)","85",{"$f":"D516+D519+D522+D525","v":0},0,"-"]
[851,"Primici za komercijalne i blagajničke zapise (šifre 8511+8512)","851",{"$f":"SUM(D517:D518)","v":0},0,"-"]
[8511,"Komercijalni i blagajnički zapisi – tuzemni","8511",0,0,"-"]
[8512,"Komercijalni i blagajnički zapisi – inozemni","8512",0,0,"-"]
[852,"Primici za obveznice (šifre 8521+8522)","852",{"$f":"SUM(D520:D521)","v":0},0,"-"]
[8521,"Obveznice – tuzemne","8521",0,0,"-"]
[8522,"Obveznice – inozemne","8522",0,0,"-"]
[853,"Primici za opcije i druge financijske derivate (šifre 8531+8532)","853",{"$f":"SUM(D523:D524)","v":0},0,"-"]
[8531,"Opcije i drugi financijski derivati – tuzemni","8531",0,0,"-"]
[8532,"Opcije i drugi financijski derivati – inozemni","8532",0,0,"-"]
[854,"Primici za ostale vrijednosne papire (šifre 8541+8542)","854",{"$f":"SUM(D526:D527)","v":0},0,"-"]
[8541,"Ostali tuzemni vrijednosni papiri","8541",0,0,"-"]
[8542,"Ostali inozemni vrijednosni papiri","8542",0,0,"-"]
[5,"Izdaci za financijsku imovinu i otplate zajmova (šifre 51+52+53+54+55)","5",{"$f":"D529+D567+D580+D593+D625","v":0},0,"-"]
[51,"Izdaci za dane zajmove i depozite (šifre 511+512+513+514+515+516+517+518)","51",{"$f":"D530+D535+D538+D542+D543+D550+D555+D563","v":0},0,"-"]
[511,"Izdaci za dane zajmove međunarodnim organizacijama, institucijama i tijelima EU te inozemnim vladama (šifre 5113 do 5116)","511",{"$f":"SUM(D531:D534)","v":0},0,"-"]
[5113,"Dani zajmovi međunarodnim organizacijama","5113",0,0,"-"]
[5114,"Dani zajmovi institucijama i tijelima EU","5114",0,0,"-"]
[5115,"Dani zajmovi inozemnim vladama u EU","5115",0,0,"-"]
[5116,"Dani zajmovi inozemnim vladama izvan EU","5116",0,0,"-"]
[512,"Izdaci za dane zajmove neprofitnim organizacijama, građanima i kućanstvima (šifre 5121+5122)","512",{"$f":"SUM(D536:D537)","v":0},0,"-"]
[5121,"Dani zajmovi neprofitnim organizacijama, građanima i kućanstvima u tuzemstvu","5121",0,0,"-"]
[5122,"Dani zajmovi neprofitnim organizacijama, građanima i kućanstvima u inozemstvu","5122",0,0,"-"]
[513,"Izdaci za dane zajmove kreditnim i ostalim financijskim institucijama u javnom sektoru (šifre 5132 do 5134)","513",{"$f":"SUM(D539:D541)","v":0},0,"-"]
[5132,"Dani zajmovi kreditnim institucijama u javnom sektoru","5132",0,0,"-"]
[5133,"Dani zajmovi osiguravajućim društvima u javnom sektoru","5133",0,0,"-"]
[5134,"Dani zajmovi ostalim financijskim institucijama u javnom sektoru","5134",0,0,"-"]
[514,"Izdaci za dane zajmove trgovačkim društvima u javnom sektoru","514",0,0,"-"]
[515,"Izdaci za dane zajmove kreditnim i ostalim financijskim institucijama izvan javnog sektora (šifre 5153 do 5158)","515",{"$f":"SUM(D544:D549)","v":0},0,"-"]
[5153,"Dani zajmovi tuzemnim kreditnim institucijama izvan javnog sektora","5153",0,0,"-"]
[5154,"Dani zajmovi tuzemnim osiguravajućim društvima izvan javnog sektora","5154",0,0,"-"]
[5155,"Dani zajmovi ostalim tuzemnim financijskim institucijama izvan javnog sektora","5155",0,0,"-"]
[5156,"Dani zajmovi inozemnim kreditnim institucijama","5156",0,0,"-"]
[5157,"Dani zajmovi inozemnim osiguravajućim društvima","5157",0,0,"-"]
[5158,"Dani zajmovi ostalim inozemnim financijskim institucijama","5158",0,0,"-"]
[516,"Izdaci za dane zajmove trgovačkim društvima i obrtnicima izvan javnog sektora (šifre 5163 do 5166)","516",{"$f":"SUM(D551:D554)","v":0},0,"-"]
[5163,"Dani zajmovi tuzemnim trgovačkim društvima izvan javnog sektora","5163",0,0,"-"]
[5164,"Dani zajmovi tuzemnim obrtnicima","5164",0,0,"-"]
[5165,"Dani zajmovi inozemnim trgovačkim društvima","5165",0,0,"-"]
[5166,"Dani zajmovi inozemnim obrtnicima","5166",0,0,"-"]
[517,"Dani zajmovi drugim razinama vlasti (šifre 5171 do 5177)","517",{"$f":"SUM(D556:D562)","v":0},0,"-"]
[5171,"Dani zajmovi državnom proračunu","5171",0,0,"-"]
[5172,"Dani zajmovi županijskim proračunima","5172",0,0,"-"]
[5173,"Dani zajmovi gradskim proračunima","5173",0,0,"-"]
[5174,"Dani zajmovi općinskim proračunima","5174",0,0,"-"]
[5175,"Dani zajmovi HZMO-u, HZZ-u i HZZO-u","5175",0,0,"-"]
[5176,"Dani zajmovi ostalim izvanproračunskim korisnicima državnog proračuna","5176",0,0,"-"]
[5177,"Dani zajmovi izvanproračunskim korisnicima županijskih, gradskih i općinskih proračuna","5177",0,0,"-"]
["518","Izdaci za depozite i jamčevne pologe (šifre 5181 do 5183)","518",{"$f":"SUM(D564:D566)","v":0},0,"-"]
["5181","Izdaci za depozite u kreditnim i ostalim financijskim institucijama - tuzemni","5181",0,0,"-"]
["5182","Izdaci za depozite u kreditnim i ostalim financijskim institucijama - inozemni","5182",0,0,"-"]
["5183","Izdaci za jamčevne pologe ","5183",0,0,"-"]
[52,"Izdaci za ulaganja u vrijednosne papire (šifre 521+522+523+524)","52",{"$f":"D568+D571+D574+D577","v":0},0,"-"]
[521,"Izdaci za komercijalne i blagajničke zapise (šifre 5211+5212)","521",{"$f":"SUM(D569:D570)","v":0},0,"-"]
[5211,"Komercijalni i blagajnički zapisi - tuzemni ","5211",0,0,"-"]
[5212,"Komercijalni i blagajnički zapisi - inozemni","5212",0,0,"-"]
[522,"Izdaci za obveznice (šifre 5221+5222)","522",{"$f":"SUM(D572:D573)","v":0},0,"-"]
[5221,"Obveznice - tuzemne","5221",0,0,"-"]
[5222,"Obveznice - inozemne","5222",0,0,"-"]
[523,"Izdaci za opcije i druge financijske derivate (šifre 5231+5232)","523",{"$f":"SUM(D575:D576)","v":0},0,"-"]
[5231,"Opcije i drugi financijski derivati - tuzemni","5231",0,0,"-"]
[5232,"Opcije i drugi financijski derivati - inozemni","5232",0,0,"-"]
[524,"Izdaci za ostale vrijednosne papire (šifre 5241+5242)","524",{"$f":"SUM(D578:D579)","v":0},0,"-"]
[5241,"Ostali tuzemni vrijednosni papiri ","5241",0,0,"-"]
[5242,"Ostali inozemni vrijednosni papiri","5242",0,0,"-"]
[53,"Izdaci za dionice i udjele u glavnici (šifre 531+532+533+534)","53",{"$f":"D581+D585+D587+D590","v":0},0,"-"]
[531,"Dionice i udjeli u glavnici kreditnih i ostalih financijskih institucija u javnom sektoru (šifre 5312 do 5314)","531",{"$f":"SUM(D582:D584)","v":0},0,"-"]
[5312,"Dionice i udjeli u glavnici kreditnih institucija u javnom sektoru","5312",0,0,"-"]
[5313,"Dionice i udjeli u glavnici osiguravajućih društava u javnom sektoru","5313",0,0,"-"]
[5314,"Dionice i udjeli u glavnici ostalih financijskih institucija u javnom sektoru","5314",0,0,"-"]
[532,"Dionice i udjeli u glavnici trgovačkih društava u javnom sektoru (šifra 5321)","532",{"$f":"D586","v":0},0,"-"]
[5321,"Dionice i udjeli u glavnici trgovačkih društava u javnom sektoru","5321",0,0,"-"]
[533,"Dionice i udjeli u glavnici kreditnih i ostalih financijskih institucija izvan javnog sektora (šifre 5331+5332)","533",{"$f":"SUM(D588:D589)","v":0},0,"-"]
[5331,"Dionice i udjeli u glavnici tuzemnih kreditnih i ostalih financijskih institucija izvan javnog sektora","5331",0,0,"-"]
[5332,"Dionice i udjeli u glavnici inozemnih kreditnih i ostalih financijskih institucija","5332",0,0,"-"]
[534,"Dionice i udjeli u glavnici trgovačkih društava izvan javnog sektora (šifre 5341+5342)","534",{"$f":"SUM(D591:D592)","v":0},0,"-"]
[5341,"Dionice i udjeli u glavnici tuzemnih trgovačkih društava izvan javnog sektora","5341",0,0,"-"]
[5342,"Dionice i udjeli u glavnici inozemnih trgovačkih društava","5342",0,0,"-"]
[54,"Izdaci za otplatu glavnice primljenih kredita i zajmova (šifre 541+542+543+544+545+547)","54",{"$f":"D594+D599+D603+D605+D612+D617","v":0},0,"-"]
[541,"Otplata glavnice primljenih kredita i zajmova od međunarodnih organizacija, institucija i tijela EU te inozemnih vlada (šifre 5413 do 5416)","541",{"$f":"SUM(D595:D598)","v":0},0,"-"]
[5413,"Otplata glavnice primljenih zajmova od međunarodnih organizacija","5413",0,0,"-"]
[5414,"Otplata glavnice primljenih kredita i zajmova od institucija i tijela EU","5414",0,0,"-"]
[5415,"Otplata glavnice primljenih zajmova od inozemnih vlada u EU","5415",0,0,"-"]
[5416,"Otplata glavnice primljenih zajmova od inozemnih vlada izvan EU","5416",0,0,"-"]
[542,"Otplata glavnice primljenih kredita i zajmova od kreditnih i ostalih financijskih institucija u javnom sektoru (šifre 5422 do 5424)","542",{"$f":"SUM(D600:D602)","v":0},0,"-"]
[5422,"Otplata glavnice primljenih kredita od kreditnih institucija u javnom sektoru","5422",0,0,"-"]
[5423,"Otplata glavnice primljenih zajmova od osiguravajućih društava u javnom sektoru","5423",0,0,"-"]
[5424,"Otplata glavnice primljenih zajmova od ostalih financijskih institucija u javnom sektoru","5424",0,0,"-"]
[543,"Otplata glavnice primljenih zajmova od trgovačkih društava u javnom sektoru (šifra 5431)","543",{"$f":"D604","v":0},0,"-"]
[5431,"Otplata glavnice primljenih zajmova od trgovačkih društava u javnom sektoru","5431",0,0,"-"]
[544,"Otplata glavnice primljenih kredita i zajmova od kreditnih i ostalih financijskih institucija izvan javnog sektora (šifre 5443 do 5448)","544",{"$f":"SUM(D606:D611)","v":0},0,"-"]
[5443,"Otplata glavnice primljenih kredita od tuzemnih kreditnih institucija izvan javnog sektora","5443",0,0,"-"]
[5444,"Otplata glavnice primljenih zajmova od tuzemnih osiguravajućih društava izvan javnog sektora","5444",0,0,"-"]
[5445,"Otplata glavnice primljenih zajmova od ostalih tuzemnih financijskih institucija izvan javnog sektora","5445",0,0,"-"]
[5446,"Otplata glavnice primljenih kredita od inozemnih kreditnih institucija","5446",0,0,"-"]
[5447,"Otplata glavnice primljenih zajmova od inozemnih osiguravajućih društava","5447",0,0,"-"]
[5448,"Otplata glavnice primljenih zajmova od ostalih inozemnih financijskih institucija","5448",0,0,"-"]
[545,"Otplata glavnice primljenih zajmova od trgovačkih društava i obrtnika izvan javnog sektora (šifre 5453 do 5456)","545",{"$f":"SUM(D613:D616)","v":0},0,"-"]
[5453,"Otplata glavnice primljenih zajmova od tuzemnih trgovačkih društava izvan javnog sektora","5453",0,0,"-"]
[5454,"Otplata glavnice primljenih zajmova od tuzemnih obrtnika","5454",0,0,"-"]
[5455,"Otplata glavnice primljenih zajmova od inozemnih trgovačkih društava","5455",0,0,"-"]
[5456,"Otplata glavnice primljenih zajmova od inozemnih obrtnika","5456",0,0,"-"]
[547,"Otplata glavnice primljenih zajmova od drugih razina vlasti (šifre 5471 do 5477)","547",{"$f":"SUM(D618:D624)","v":0},0,"-"]
[5471,"Otplata glavnice primljenih zajmova od državnog proračuna","5471",0,0,"-"]
[5472,"Otplata glavnice primljenih zajmova od županijskih proračuna","5472",0,0,"-"]
[5473,"Otplata glavnice primljenih zajmova od gradskih proračuna","5473",0,0,"-"]
[5474,"Otplata glavnice primljenih zajmova od općinskih proračuna","5474",0,0,"-"]
[5475,"Otplata glavnice primljenih zajmova od HZMO-a, HZZ-a i HZZO-a","5475",0,0,"-"]
[5476,"Otplata glavnice primljenih zajmova od ostalih izvanproračunskih korisnika državnog proračuna","5476",0,0,"-"]
[5477,"Otplata glavnice primljenih zajmova od izvanproračunskih korisnika županijskih, gradskih i općinskih proračuna","5477",0,0,"-"]
[55,"Izdaci za otplatu glavnice za izdane vrijednosne papire (šifre 551+552+553)","55",{"$f":"D626+D629+D632","v":0},0,"-"]
[551,"Izdaci za otplatu glavnice za izdane trezorske zapise (šifre 5511+5512)","551",{"$f":"SUM(D627:D628)","v":0},0,"-"]
[5511,"Izdaci za otplatu glavnice za izdane trezorske zapise u zemlji","5511",0,0,"-"]
[5512,"Izdaci za otplatu glavnice za izdane trezorske zapise u inozemstvu","5512",0,0,"-"]
[552,"Izdaci za otplatu glavnice za izdane obveznice (šifre 5521+5522)","552",{"$f":"SUM(D630:D631)","v":0},0,"-"]
[5521,"Izdaci za otplatu glavnice za izdane obveznice u zemlji","5521",0,0,"-"]
[5522,"Izdaci za otplatu glavnice za izdane obveznice u inozemstvu","5522",0,0,"-"]
[553,"Izdaci za otplatu glavnice za izdane ostale vrijednosne papire (šifre 5531+5532)","553",{"$f":"SUM(D633:D634)","v":0},0,"-"]
[5531,"Izdaci za otplatu glavnice za izdane ostale vrijednosne papire u zemlji","5531",0,0,"-"]
[5532,"Izdaci za otplatu glavnice za izdane ostale vrijednosne papire u inozemstvu","5532",0,0,"-"]
[" ","VIŠAK PRIMITAKA OD FINANCIJSKE IMOVINE I ZADUŽIVANJA (šifre 8-5)","X003",{"$f":"IF(D420-D528>=0,D420-D528,0)","v":0},0,"-"]
[" ","MANJAK PRIMITAKA OD FINANCIJSKE IMOVINE I ZADUŽIVANJA (šifre 5-8)","Y003",{"$f":"IF(D528-D420>=0,D528-D420,0)","v":0},0,"-"]
[92213,"Višak primitaka od financijske imovine - preneseni ","92213",0,0,"-"]
[92223,"Manjak primitaka od financijske imovine - preneseni","92223",0,0,"-"]
[" ","UKUPNI PRIHODI I PRIMICI (šifre X067+8)","X678",{"$f":"D412+D420","v":95889.13},112184.11,116.99356329544339]
[" ","UKUPNI RASHODI I IZDACI (šifre Y034+5)","Y345",{"$f":"D413+D528","v":94377.540000000008},113277.48999999999,120.02589811092766]
[" ","VIŠAK PRIHODA I PRIMITAKA (šifre X678-Y345)","X005",{"$f":"IF(D639>=D640,D639-D640,0)","v":1511.5899999999965},0,0]
[" ","MANJAK PRIHODA I PRIMITAKA (šifre Y345-X678)","Y005",{"$f":"IF(D640>=D639,D640-D639,0)","v":0},1093.3799999999901,"-"]
["9221-9222","Višak prihoda i primitaka - preneseni (šifre '9221x,9222x VP' - '9221x,9222x MP' + 92213 - 92223)","9221-9222",{"$f":"IF(D416-D417+D637-D638>=0,D416-D417+D637-D638,0)","v":5118.34},6629.9299999999994,129.53281728060267]
["9222-9221","Manjak prihoda i primitaka - preneseni (šifre '9221x,9222x MP' - '9221x,9222x VP' + 92223 - 92213)","9222-9221",{"$f":"IF(D417-D416+D638-D637>=0,D417-D416+D638-D637,0)","v":0},0,"-"]
[" ","Višak prihoda i primitaka raspoloživ u sljedećem razdoblju (šifre X005 + '9221-9222' - Y005 - '9222-9221')","X006",{"$f":"IF(D641+D643-D642-D644>=0,D641+D643-D642-D644,0)","v":6629.9299999999967},5536.5500000000093,83.508423165855632]
[" ","Manjak prihoda i primitaka za pokriće u sljedećem razdoblju (šifre Y005 + '9222-9221' - X005 - '9221-9222' )","Y006",{"$f":"IF(D642+D644-D641-D643>=0,D642+D644-D641-D643,0)","v":0},0,"-"]
["19","Rashodi budućih razdoblja i nedospjela naplata prihoda (aktivna vremenska razgraničenja)","19",0,0,"-"]
["Obvezni analitički podaci"]
[11,"Stanje novčanih sredstava na početku izvještajnog razdoblja","11P",0,0,{"$f":"IF(D649<>0,IF(E649/D649>=100,\">>100\",E649/D649*100),\"-\")","v":"-"}]
["11-dugov.","Ukupni priljevi na novčane račune i blagajne","11-dugov.",0,0,"-"]
["11-potraž.","Ukupni odljevi s novčanih računa i blagajni","11-potraž.",0,0,"-"]
[11,"Stanje novčanih sredstava na kraju izvještajnog razdoblja (šifre 11P + '11-dugov.' - '11-potraž.')","11K",{"$f":"+D649+D650-D651","v":0},0,"-"]
[" ","Prosječan broj zaposlenih u tijelima na osnovi stanja na početku i na kraju izvještajnog razdoblja (cijeli broj)","Z006",0,0,"-"]
[" ","Prosječan broj zaposlenih kod korisnika na osnovi stanja na početku i na kraju izvještajnog razdoblja (cijeli broj)","Z007",3,3,100]
[" ","Prosječan broj zaposlenih u tijelima na osnovi sati rada (cijeli broj)","Z008",0,0,"-"]
[" ","Prosječan broj zaposlenih kod korisnika na osnovi sati rada (cijeli broj)","Z009",3,3,100]
["dio 611","Ostvareni prihodi iz dodatnog udjela poreza na dohodak za decentralizirane funkcije","dio611",0,0,"-"]
[61315,"Porez na korištenje javnih površina","61315",0,0,"-"]
[61451,"Porez na cestovna motorna vozila","61451",0,0,"-"]
[61453,"Porez na tvrtku odnosno naziv tvrtke","61453",0,0,"-"]
[63311,"Tekuće pomoći iz državnog proračuna","63311",0,0,"-"]
[63312,"Tekuće pomoći iz županijskih proračuna","63312",0,0,"-"]
[63313,"Tekuće pomoći iz gradskih proračuna","63313",0,0,"-"]
[63314,"Tekuće pomoći iz općinskih proračuna","63314",0,0,"-"]
[63321,"Kapitalne pomoći iz državnog proračuna","63321",0,0,"-"]
[63322,"Kapitalne pomoći iz županijskih proračuna","63322",0,0,"-"]
[63323,"Kapitalne pomoći iz gradskih proračuna","63323",0,0,"-"]
[63324,"Kapitalne pomoći iz općinskih proračuna","63324",0,0,"-"]
[63414,"Tekuće pomoći od HZMO-a, HZZ-a i HZZO-a ","63414",0,0,"-"]
[63415,"Tekuće pomoći od ostalih izvanproračunskih korisnika državnog proračuna","63415",0,0,"-"]
[63416,"Tekuće pomoći od izvanproračunskih korisnika županijskih, gradskih i općinskih proračuna","63416",0,0,"-"]
[63424,"Kapitalne pomoći od HZMO-a, HZZ-a i HZZO-a ","63424",0,0,"-"]
[63425,"Kapitalne pomoći od ostalih izvanproračunskih korisnika državnog proračuna","63425",0,0,"-"]
[63426,"Kapitalne pomoći od izvanproračunskih korisnika županijskih, gradskih i općinskih proračuna","63426",0,0,"-"]
[63612,"Tekuće pomoći iz državnog proračuna proračunskim korisnicima proračuna JLP(R)S","63612",0,0,"-"]
[63613,"Tekuće pomoći proračunskim korisnicima iz proračuna JLP(R)S koji im nije nadležan","63613",0,0,"-"]
[63622,"Kapitalne pomoći iz državnog proračuna proračunskim korisnicima proračuna JLP(R)S","63622",4645.3,8145.3,175.34497233763159]
[63623,"Kapitalne pomoći proračunskim korisnicima iz proračuna JLP(R)S koji im nije nadležan","63623",663.61,0,0]
[63711,"Pomoći iz državnog proračuna po protestiranim jamstvima",63711,0,0,"-"]
[63712,"Pomoći iz županijskih proračuna po protestiranim jamstvima",63712,0,0,"-"]
[63713,"Pomoći iz gradskih proračuna po protestiranim jamstvima",63713,0,0,"-"]
[63714,"Pomoći iz općinskih proračuna po protestiranim jamstvima",63714,0,0,"-"]
[63715,"Pomoći od HZMO-a, HZZ-a i HZZO-a po protestiranim jamstvima",63715,0,0,"-"]
[63716,"Pomoći od ostalih izvanproračunskih korisnika državnog proračuna po protestiranim jamstvima",63716,0,0,"-"]
[63717,"Pomoći od izvanproračunskih korisnika županijskih, gradskih i općinskih proračuna po protestiranim jamstvima",63717,0,0,"-"]
[63721,"Povrat pomoći danih proračunskim korisnicima državnog proračuna po protestiranim jamstvima",63721,0,0,"-"]
[63722,"Povrat pomoći danih proračunskim korisnicima županijskih, gradskih i općinskih proračuna po protestiranim jamstvima",63722,0,0,"-"]
[63723,"Povrat pomoći danih županijskim proračunima po protestiranim jamstvima",63723,0,0,"-"]
[63724,"Povrat pomoći danih gradskim proračunima po protestiranim jamstvima",63724,0,0,"-"]
[63725,"Povrat pomoći danih općinskim proračunima po protestiranim jamstvima",63725,0,0,"-"]
[63726,"Povrat pomoći danih HZMO-u, HZZ-u i HZZO-u po protestiranim jamstvima",63726,0,0,"-"]
[63727,"Povrat pomoći danih ostalim izvanproračunskim korisnicima državnog proračuna po protestiranim jamstvima",63727,0,0,"-"]
[63728,"Povrat pomoći danih izvanproračunskim korisnicima županijskih, gradskih i općinskih proračuna po protestiranim jamstvima",63728,0,0,"-"]
[63811,"Tekuće pomoći iz državnog proračuna temeljem prijenosa EU sredstava","63811",0,0,"-"]
[63812,"Tekuće pomoći iz proračuna JLP(R)S temeljem prijenosa EU sredstava","63812",0,0,"-"]
["63813","Tekuće pomoći od proračunskog korisnika drugog proračuna temeljem prijenosa EU sredstava","63813",0,0,"-"]
["63814","Tekuće pomoći od izvanproračunskog korisnika temeljem prijenosa EU sredstava","63814",0,0,"-"]
[63821,"Kapitalne pomoći iz državnog proračuna temeljem prijenosa EU sredstava","63821",0,0,"-"]
[63822,"Kapitalne pomoći iz proračuna JLP(R)S temeljem prijenosa EU sredstava","63822",0,0,"-"]
["63823","Kapitalne pomoći od proračunskog korisnika drugog proračuna temeljem prijenosa EU sredstava","63823",0,0,"-"]
["63824","Kapitalne pomoći od izvanproračunskog korisnika temeljem prijenosa EU sredstava","63824",0,0,"-"]
[64191,"Premije na izdane vrijednosne papire","64191",0,0,"-"]
[64371,"Prihodi od kamata na dane zajmove državnom proračunu","64371",0,0,"-"]
[64372,"Prihodi od kamata na dane zajmove županijskim proračunima","64372",0,0,"-"]
[64373,"Prihodi od kamata na dane zajmove gradskim proračunima","64373",0,0,"-"]
[64374,"Prihodi od kamata na dane zajmove općinskim proračunima","64374",0,0,"-"]
[64375,"Prihodi od kamata na dane zajmove HZMO-u, HZZ-u i HZZO-u","64375",0,0,"-"]
[64376,"Prihodi od kamata na dane zajmove ostalim izvanproračunskim korisnicima državnog proračuna","64376",0,0,"-"]
[64377,"Prihodi od kamata na dane zajmove izvanproračunskim korisnicima županijskih, gradskih i općinskih proračuna","64377",0,0,"-"]
[65264,"Sufinanciranje cijene usluge, participacije i slično","65264",1101.1300000000001,1060.07,96.271103321133737]
[65265,"Dopunsko zdravstveno osiguranje","65265",0,0,"-"]
["65267","Prihodi s naslova osiguranja, refundacije štete i totalne štete","65267",0,0,"-"]
[66341,"Povrat kapitalnih pomoći danih trgovačkim društvima u javnom sektoru po protestiranim jamstvima",66341,0,0,"-"]
[66342,"Povrat kapitalnih pomoći danih tuzemnim trgovačkim društvima izvan javnog sektora po protestiranim jamstvima",66342,0,0,"-"]
[66343,"Povrat kapitalnih pomoći danih tuzemnim obrtnicima po protestiranim jamstvima",66343,0,0,"-"]
[31214,"Otpremnine","31214",0,0,"-"]
[31215,"Naknade za bolest, invalidnost i smrtni slučaj","31215",476.93,0,0]
[32121,"Naknade za prijevoz na posao i s posla","32121",1639.13,1815.6,110.76607712628039]
["32351","Zakupnine za zemljišta","32351",0,0,"-"]
["32361","Obvezni i preventivni zdravstveni pregledi zaposlenika","32361",0,0,"-"]
["32371","Autorski honorari","32371",2798.23,2437.37,87.103990737001595]
["32372","Ugovori o djelu","32372",340.84,4519.62,1326.0239408520129]
["32377","Usluge agencija, studentskog servisa (prijepisi, prijevodi i drugo)","32377",0,0,"-"]
["32398","Naknada za energetsku uslugu","32398",0,0,"-"]
[32911,"Naknade za rad članovima predstavničkih i izvršnih tijela i upravnih vijeća","32911",0,0,{"$f":"IF(D725<>0,IF(E725/D725>=100,\">>100\",E725/D725*100),\"-\")","v":"-"}]
["32923","Premije osiguranja zaposlenih","32923",692.43,814.44,117.62055370217929]
[34111,"Kamate za izdane trezorske zapise u zemlji","34111",0,0,"-"]
[34112,"Kamate za izdane trezorske zapise u inozemstvu","34112",0,0,"-"]
[34121,"Kamate za izdane mjenice u domaćoj valuti","34121",0,0,"-"]
[34122,"Kamate za izdane mjenice u stranoj valuti","34122",0,0,"-"]
[34131,"Kamate za izdane obveznice u zemlji","34131",0,0,"-"]
[34132,"Kamate za izdane obveznice u inozemstvu","34132",0,0,"-"]
[34191,"Kamate za ostale vrijednosne papire u zemlji","34191",0,0,"-"]
[34192,"Kamate za ostale vrijednosne papire u inozemstvu","34192",0,0,"-"]
[34213,"Kamate za primljene zajmove od međunarodnih organizacija","34213",0,0,"-"]
[34214,"Kamate za primljene kredite i zajmove od institucija i tijela EU","34214",0,0,"-"]
[34215,"Kamate za primljene zajmove od inozemnih vlada u EU","34215",0,0,"-"]
[34216,"Kamate za primljene zajmove od inozemnih vlada izvan EU","34216",0,0,"-"]
[34222,"Kamate za primljene kredite od kreditnih institucija u javnom sektoru","34222",0,0,"-"]
[34223,"Kamate za primljene zajmove od osiguravajućih društava u javnom sektoru","34223",0,0,"-"]
[34224,"Kamate za primljene zajmove od ostalih financijskih institucija u javnom sektoru","34224",0,0,"-"]
[34233,"Kamate za primljene kredite od tuzemnih kreditnih institucija izvan javnog sektora","34233",0,0,"-"]
[34234,"Kamate za primljene zajmove od tuzemnih osiguravajućih društava izvan javnog sektora","34234",0,0,"-"]
[34235,"Kamate za primljene zajmove od ostalih tuzemnih financijskih institucija izvan javnog sektora","34235",0,0,"-"]
[34236,"Kamate za primljene kredite od inozemnih kreditnih institucija","34236",0,0,"-"]
[34237,"Kamate za primljene zajmove od inozemnih osiguravajućih društava","34237",0,0,"-"]
[34238,"Kamate za primljene zajmove od ostalih inozemnih financijskih institucija","34238",0,0,"-"]
[34273,"Kamate za primljene zajmove od tuzemnih trgovačkih društava izvan javnog sektora","34273",0,0,"-"]
[34274,"Kamate za primljene zajmove od tuzemnih obrtnika","34274",0,0,"-"]
[34275,"Kamate za primljene zajmove od inozemnih trgovačkih društava","34275",0,0,"-"]
[34281,"Kamate za primljene zajmove od državnog proračuna","34281",0,0,"-"]
[34282,"Kamate za primljene zajmove od županijskih proračuna","34282",0,0,"-"]
[34283,"Kamate za primljene zajmove od gradskih proračuna","34283",0,0,"-"]
[34284,"Kamate za primljene zajmove od općinskih proračuna","34284",0,0,"-"]
[34285,"Kamate za primljene zajmove od HZMO-a, HZZ-a, HZZO-a","34285",0,0,"-"]
[34286,"Kamate za primljene zajmove od ostalih izvanproračunskih korisnika državnog proračuna","34286",0,0,"-"]
[34287,"Kamate za primljene zajmove od izvanproračunskih korisnika županijskih, gradskih i općinskih proračuna","34287",0,0,"-"]
[34341,"Diskont na izdane vrijednosne papire","34341",0,0,"-"]
[35231,"Subvencije poljoprivrednicima","35231",0,0,"-"]
[35232,"Subvencije obrtnicima","35232",0,0,"-"]
[36313,"Tekuće pomoći državnom proračunu","36313",0,0,"-"]
[36314,"Tekuće pomoći županijskim proračunima","36314",0,0,"-"]
[36315,"Tekuće pomoći gradskim proračunima","36315",0,0,"-"]
[36316,"Tekuće pomoći općinskim proračunima","36316",0,0,"-"]
[36317,"Tekuće pomoći HZMO-u, HZZ-u i HZZO-u","36317",0,0,"-"]
[36318,"Tekuće pomoći ostalim izvanproračunskim korisnicima državnog proračuna","36318",0,0,"-"]
[36319,"Tekuće pomoći izvanproračunskim korisnicima županijskih, gradskih i općinskih proračuna","36319",0,0,"-"]
[36323,"Kapitalne pomoći državnom proračunu","36323",0,0,"-"]
[36324,"Kapitalne pomoći županijskim proračunima","36324",0,0,"-"]
[36325,"Kapitalne pomoći gradskim proračunima","36325",0,0,"-"]
[36326,"Kapitalne pomoći općinskim proračunima","36326",0,0,"-"]
[36327,"Kapitalne pomoći HZMO-u, HZZ-u i HZZO-u","36327",0,0,"-"]
[36328,"Kapitalne pomoći ostalim izvanproračunskim korisnicima državnog proračuna","36328",0,0,"-"]
[36329,"Kapitalne pomoći izvanproračunskim korisnicima županijskih, gradskih i općinskih proračuna","36329",0,0,"-"]
["36351","Pomoći županijskim proračunima po protestiranim jamstvima","36351",0,0,"-"]
["36352","Pomoći gradskim proračunima po protestiranim jamstvima","36352",0,0,"-"]
["36353","Pomoći općinskim proračunima po protestiranim jamstvima","36353",0,0,"-"]
["36354","Pomoći HZMO-u, HZZ-u i HZZO-u po protestiranim jamstvima","36354",0,0,"-"]
["36355","Pomoći ostalim izvanproračunskim korisnicima državnog proračuna po protestiranim jamstvima","36355",0,0,"-"]
["36356","Pomoći izvanproračunskim korisnicima županijskih, gradskih i općinskih proračuna po protestiranim jamstvima","36356",0,0,"-"]
["36361","Povrat pomoći primljenih iz državnog proračuna po protestiranim jamstvima","36361",0,0,"-"]
["36362","Povrat pomoći primljenih iz županijskih proračuna po protestiranim jamstvima","36362",0,0,"-"]
["36363","Povrat pomoći primljenih iz gradskih proračuna po protestiranim jamstvima","36363",0,0,"-"]
["36364","Povrat pomoći primljenih iz općinskih proračuna po protestiranim jamstvima","36364",0,0,"-"]
["36365","Povrat pomoći primljenih od  HZMO-a, HZZ-a i HZZO-a po protestiranim jamstvima","36365",0,0,"-"]
["36366","Povrat pomoći primljenih od ostalih izvanproračunskih korisnika državnog proračuna po protestiranim jamstvima","36366",0,0,"-"]
["36367","Povrat pomoći primljenih od izvanproračunskih korisnika županijskih, gradskih i općinskih proračuna po protestiranim jamstvima","36367",0,0,"-"]
["36631","Pomoći proračunskim korisnicima državnog proračuna po protestiranim jamstvima","36631",0,0,"-"]
["36632","Pomoći proračunskim korisnicima županijskih, gradskih i općinskih proračuna po protestiranim jamstvima","36632",0,0,"-"]
["36811","Tekuće pomoći proračunskim korisnicima državnog proračuna temeljem prijenosa sredstava EU","36811",0,0,"-"]
["36812","Tekuće pomoći proračunskim korisnicima županijskih proračuna temeljem prijenosa EU sredstava","36812",0,0,"-"]
["36813","Tekuće pomoći proračunskim korisnicima gradskih proračuna temeljem prijenosa EU sredstava","36813",0,0,"-"]
["36814","Tekuće pomoći proračunskim korisnicima općinskih proračuna temeljem prijenosa EU sredstava","36814",0,0,"-"]
["36815","Tekuće pomoći županijskim proračunima temeljem prijenosa EU sredstava","36815",0,0,"-"]
["36816","Tekuće pomoći gradskim proračunima temeljem prijenosa EU sredstava","36816",0,0,"-"]
["36817","Tekuće pomoći općinskim proračunima temeljem prijenosa EU sredstava","36817",0,0,"-"]
["36818","Tekuće pomoći izvanproračunskim korisnicima državnog proračuna temeljem prijenosa EU sredstava","36818",0,0,"-"]
["36819","Tekuće pomoći izvanproračunskim korisnicima županijskih, gradskih i općinskih proračuna temeljem prijenosa EU sredstava","36819",0,0,"-"]
["36821","Kapitalne pomoći proračunskim korisnicima državnog proračuna temeljem prijenosa sredstava EU","36821",0,0,"-"]
["36822","Kapitalne pomoći proračunskim korisnicima županijskih proračuna temeljem prijenosa EU sredstava","36822",0,0,"-"]
["36823","Kapitalne pomoći proračunskim korisnicima gradskih proračuna temeljem prijenosa EU sredstava","36823",0,0,"-"]
["36824","Kapitalne pomoći proračunskim korisnicima općinskih proračuna temeljem prijenosa EU sredstava","36824",0,0,"-"]
["36825","Kapitalne pomoći županijskim proračunima temeljem prijenosa EU sredstava","36825",0,0,"-"]
["36826","Kapitalne pomoći gradskim proračunima temeljem prijenosa EU sredstava","36826",0,0,"-"]
["36827","Kapitalne pomoći općinskim proračunima temeljem prijenosa EU sredstava","36827",0,0,"-"]
["36828","Kapitalne pomoći izvanproračunskim korisnicima državnog proračuna temeljem prijenosa EU sredstava","36828",0,0,"-"]
["36829","Kapitalne pomoći izvanproračunskim korisnicima županijskih, gradskih i općinskih proračuna temeljem prijenosa EU sredstava","36829",0,0,"-"]
["37131","Naknade za bolest i invaliditet","37131",0,0,"-"]
["37132","Naknade za zdravstvenu zaštitu u inozemstvu","37132",0,0,"-"]
["37139","Ostale naknade na temelju osiguranja u novcu","37139",0,0,"-"]
["37141","Medicinske (zdravstvene) usluge ","37141",0,0,"-"]
["37143","Farmaceutski proizvodi","37143",0,0,"-"]
["37144","Pomoć i njega u kući","37144",0,0,"-"]
["37149","Ostale naknade na temelju osiguranja u naravi","37149",0,0,"-"]
["37211","Naknade za dječji doplatak","37211",0,0,"-"]
["37212","Pomoć obiteljima i kućanstvima","37212",0,0,"-"]
["37213","Pomoć osobama s invaliditetom","37213",0,0,"-"]
["37214","Naknade za mirovine i dodatke - posebni propis","37214",0,0,"-"]
[37215,"Stipendije i školarine","37215",0,0,"-"]
[37216,"Naknade za pomoć bivšim političkim zatvorenicima i neosnovano pritvorenim osobama","37216",0,0,"-"]
[37217,"Porodiljne naknade i oprema za novorođenčad","37217",0,0,"-"]
[37218,"Pomoć nezaposlenim osobama","37218",0,0,"-"]
[37219,"Ostale naknade iz proračuna u novcu","37219",0,0,"-"]
[37221,"Sufinanciranje cijene prijevoza","37221",0,0,"-"]
["37222","Pomoć i njega u kući","37222",0,0,"-"]
["37223","Stanovanje","37223",0,0,"-"]
["37224","Prehrana","37224",0,0,"-"]
["37229","Ostale naknade iz proračuna u naravi","37229",0,0,"-"]
[38117,"Tekuće donacije građanima i kućanstvima","38117",0,0,"-"]
[38612,"Kapitalne pomoći trgovačkim društvima u javnom sektoru","38612",0,0,"-"]
[38613,"Kapitalne pomoći kreditnim institucijama u javnom sektoru","38613",0,0,"-"]
[38614,"Kapitalne pomoći osiguravajućim društvima u javnom sektoru","38614",0,0,"-"]
[38615,"Kapitalne pomoći ostalim financijskim institucijama u javnom sektoru","38615",0,0,"-"]
[38622,"Kapitalne pomoći trgovačkim društvima izvan javnog sektora","38622",0,0,"-"]
[38623,"Kapitalne pomoći kreditnim institucijama izvan javnog sektora","38623",0,0,"-"]
[38624,"Kapitalne pomoći osiguravajućim društvima izvan javnog sektora","38624",0,0,"-"]
[38625,"Kapitalne pomoći ostalim financijskim institucijama izvan javnog sektora","38625",0,0,"-"]
["38626","Kapitalne pomoći zadrugama","38626",0,0,"-"]
[38631,"Kapitalne pomoći poljoprivrednicima","38631",0,0,"-"]
[38632,"Kapitalne pomoći obrtnicima","38632",0,0,"-"]
[38641,"Kapitalne pomoći subjektima u javnom sektoru iz EU sredstava ","38641",0,0,"-"]
["38642","Kapitalne pomoći subjektima izvan javnog sektora iz EU sredstava ","38642",0,0,"-"]
["38651","Kapitalne pomoći trgovačkim društvima u javnom sektoru po protestiranim jamstvima","38651",0,0,"-"]
["38652","Kapitalne pomoći tuzemnim trgovačkim društvima izvan javnog sektora po protestiranim jamstvima","38652",0,0,"-"]
["38653","Kapitalne pomoći tuzemnim obrtnicima po protestiranim jamstvima","38653",0,0,"-"]
[81212,"Povrat zajmova danih neprofitnim organizacijama, građanima i kućanstvima u tuzemstvu – dugoročni","81212",0,0,"-"]
[81322,"Povrat zajmova danih kreditnim institucijama u javnom sektoru – dugoročni","81322",0,0,"-"]
[81332,"Povrat zajmova danih osiguravajućim društvima u javnom sektoru – dugoročni","81332",0,0,"-"]
[81342,"Povrat zajmova danih ostalim financijskim institucijama u javnom sektoru – dugoročni","81342",0,0,"-"]
[81411,"Povrat zajmova danih trgovačkim društvima u javnom sektoru – kratkoročni","81411",0,0,"-"]
[81412,"Povrat zajmova danih trgovačkim društvima u javnom sektoru – dugoročni","81412",0,0,"-"]
[81532,"Povrat zajmova danih tuzemnim kreditnim institucijama izvan javnog sektora – dugoročni","81532",0,0,"-"]
[81542,"Povrat zajmova danih tuzemnim osiguravajućim društvima izvan javnog sektora – dugoročni","81542",0,0,"-"]
[81552,"Povrat zajmova danih ostalim tuzemnim financijskim institucijama izvan javnog sektora - dugoročni","81552",0,0,"-"]
[81631,"Povrat zajmova danih tuzemnim trgovačkim društvima izvan javnog sektora - kratkoročni","81631",0,0,"-"]
[81632,"Povrat zajmova danih tuzemnim trgovačkim društvima izvan javnog sektora - dugoročni","81632",0,0,"-"]
[81641,"Povrat zajmova danih tuzemnim obrtnicima - kratkoročni","81641",0,0,"-"]
[81642,"Povrat zajmova danih tuzemnim obrtnicima - dugoročni","81642",0,0,"-"]
[81711,"Povrat zajmova danih državnom proračunu - kratkoročni","81711",0,0,"-"]
[81712,"Povrat zajmova danih državnom proračunu - dugoročni","81712",0,0,"-"]
[81721,"Povrat zajmova danih županijskim proračunima - kratkoročni","81721",0,0,"-"]
[81722,"Povrat zajmova danih županijskim proračunima - dugoročni","81722",0,0,"-"]
[81731,"Povrat zajmova danih gradskim proračunima - kratkoročni","81731",0,0,"-"]
[81732,"Povrat zajmova danih gradskim proračunima - dugoročni","81732",0,0,"-"]
[81741,"Povrat zajmova danih općinskim proračunima - kratkoročni","81741",0,0,"-"]
[81742,"Povrat zajmova danih općinskim proračunima - dugoročni","81742",0,0,"-"]
[81751,"Povrat zajmova danih HZMO-u, HZZ-u i HZZO-u - kratkoročni","81751",0,0,"-"]
[81752,"Povrat zajmova danih HZMO-u, HZZ-u i HZZO-u - dugoročni","81752",0,0,"-"]
[81761,"Povrat zajmova danih ostalim izvanproračunskim korisnicima državnog proračuna - kratkoročni","81761",0,0,"-"]
[81762,"Povrat zajmova danih ostalim izvanproračunskim korisnicima državnog proračuna - dugoročni","81762",0,0,"-"]
[81771,"Povrat zajmova danih izvanproračunskim korisnicima županijskih, gradskih i općinskih proračuna - kratkoročni","81771",0,0,"-"]
[81772,"Povrat zajmova danih izvanproračunskim korisnicima županijskih, gradskih i općinskih proračuna - dugoročni","81772",0,0,"-"]
[82412,"Ostali vrijednosni papiri - tuzemni - dugoročni","82412",0,0,"-"]
[84132,"Primljeni zajmovi od međunarodnih organizacija - dugoročni","84132",0,0,"-"]
[84142,"Primljeni krediti i zajmovi od institucija i tijela EU - dugoročni","84142",0,0,"-"]
[84152,"Primljeni zajmovi od inozemnih vlada u EU - dugoročni","84152",0,0,"-"]
[84162,"Primljeni zajmovi od inozemnih vlada izvan EU - dugoročni","84162",0,0,"-"]
[84221,"Primljeni krediti od kreditnih institucija u javnom sektoru - kratkoročni","84221",0,0,"-"]
[84222,"Primljeni krediti od kreditnih institucija u javnom sektoru - dugoročni","84222",0,0,"-"]
["84223","Primljeni financijski leasing od kreditnih institucija u javnom sektoru","84223",0,0,"-"]
[84232,"Primljeni zajmovi od osiguravajućih društava u javnom sektoru - dugoročni","84232",0,0,"-"]
[84242,"Primljeni zajmovi od ostalih financijskih institucija u javnom sektoru - dugoročni","84242",0,0,"-"]
["84243","Primljeni financijski leasing od ostalih financijskih institucija u javnom sektoru","84243",0,0,"-"]
[84312,"Primljeni zajmovi od trgovačkih društava u javnom sektoru - dugoročni","84312",0,0,"-"]
[84431,"Primljeni krediti od tuzemnih kreditnih institucija izvan javnog sektora - kratkoročni","84431",0,0,"-"]
[84432,"Primljeni krediti od tuzemnih kreditnih institucija izvan javnog sektora - dugoročni","84432",0,0,"-"]
["84433","Primljeni financijski leasing od tuzemnih kreditnih institucija izvan javnog sektora","84433",0,0,"-"]
[84442,"Primljeni zajmovi od tuzemnih osiguravajućih društava izvan javnog sektora - dugoročni","84442",0,0,"-"]
[84452,"Primljeni zajmovi od ostalih tuzemnih financijskih institucija izvan javnog sektora - dugoročni","84452",0,0,"-"]
["84453","Primljeni financijski leasing od ostalih tuzemnih financijskih institucija izvan javnog sektora","84453",0,0,"-"]
[84461,"Primljeni krediti od inozemnih kreditnih institucija - kratkoročni","84461",0,0,"-"]
[84462,"Primljeni krediti od inozemnih kreditnih institucija - dugoročni","84462",0,0,"-"]
["84463","Primljeni financijski leasing od inozemnih kreditnih institucija","84463",0,0,"-"]
[84472,"Primljeni zajmovi od inozemnih osiguravajućih društava - dugoročni","84472",0,0,"-"]
[84482,"Primljeni zajmovi od ostalih inozemnih financijskih institucija - dugoročni","84482",0,0,"-"]
["84483","Primljeni financijski leasing od ostalih inozemnih financijskih institucija","84483",0,0,"-"]
[84532,"Primljeni zajmovi od tuzemnih trgovačkih društava izvan javnog sektora - dugoročni","84532",0,0,"-"]
[84542,"Primljeni zajmovi od tuzemnih obrtnika - dugoročni","84542",0,0,"-"]
[84552,"Primljeni zajmovi od inozemnih trgovačkih društava - dugoročni","84552",0,0,"-"]
[84711,"Primljeni zajmovi od državnog proračuna - kratkoročni","84711",0,0,"-"]
[84712,"Primljeni zajmovi od državnog proračuna - dugoročni","84712",0,0,"-"]
[84721,"Primljeni zajmovi od županijskih proračuna - kratkoročni","84721",0,0,"-"]
[84722,"Primljeni zajmovi od županijskih proračuna - dugoročni","84722",0,0,"-"]
[84731,"Primljeni zajmovi od gradskih proračuna - kratkoročni","84731",0,0,"-"]
[84732,"Primljeni zajmovi od gradskih proračuna - dugoročni","84732",0,0,"-"]
[84741,"Primljeni zajmovi od općinskih proračuna - kratkoročni","84741",0,0,"-"]
[84742,"Primljeni zajmovi od općinskih proračuna - dugoročni","84742",0,0,"-"]
[84751,"Primljeni zajmovi od HZMO-a, HZZ-a i HZZO-a - kratkoročni","84751",0,0,"-"]
[84752,"Primljeni zajmovi od HZMO-a, HZZ-a i HZZO-a - dugoročni","84752",0,0,"-"]
[84761,"Primljeni zajmovi od ostalih izvanproračunskih korisnika državnog proračuna - kratkoročni","84761",0,0,"-"]
[84762,"Primljeni zajmovi od ostalih izvanproračunskih korisnika državnog proračuna - dugoročni","84762",0,0,"-"]
["84771","Primljeni zajmovi od izvanproračunskih korisnika županijskih, gradskih i općinskih proračuna - kratkoročni","84771",0,0,"-"]
["84772","Primljeni zajmovi od izvanproračunskih korisnika županijskih, gradskih i općinskih proračuna - dugoročni","84772",0,0,"-"]
[85412,"Ostali tuzemni vrijednosni papiri - dugoročni","85412",0,0,"-"]
[51212,"Dani zajmovi neprofitnim organizacijama, građanima i kućanstvima u tuzemstvu – dugoročni","51212",0,0,"-"]
[51322,"Dani zajmovi kreditnim institucijama u javnom sektoru – dugoročni","51322",0,0,"-"]
[51332,"Dani zajmovi osiguravajućim društvima u javnom sektoru – dugoročni","51332",0,0,"-"]
[51342,"Dani zajmovi ostalim financijskim institucijama u javnom sektoru – dugoročni","51342",0,0,"-"]
[51411,"Dani zajmovi trgovačkim društvima u javnom sektoru – kratkoročni","51411",0,0,"-"]
[51412,"Dani zajmovi trgovačkim društvima u javnom sektoru – dugoročni","51412",0,0,"-"]
[51532,"Dani zajmovi tuzemnim kreditnim institucijama izvan javnog sektora – dugoročni","51532",0,0,"-"]
[51542,"Dani zajmovi tuzemnim osiguravajućim društvima izvan javnog sektora – dugoročni","51542",0,0,"-"]
[51552,"Dani zajmovi ostalim tuzemnim financijskim institucijama izvan javnog sektora – dugoročni","51552",0,0,"-"]
[51631,"Dani zajmovi tuzemnim trgovačkim društvima izvan javnog sektora – kratkoročni","51631",0,0,"-"]
[51632,"Dani zajmovi tuzemnim trgovačkim društvima izvan javnog sektora – dugoročni","51632",0,0,"-"]
[51641,"Dani zajmovi tuzemnim obrtnicima – kratkoročni","51641",0,0,"-"]
[51642,"Dani zajmovi tuzemnim obrtnicima – dugoročni","51642",0,0,"-"]
[51711,"Dani zajmovi državnom proračunu – kratkoročni","51711",0,0,"-"]
[51712,"Dani zajmovi državnom proračunu – dugoročni","51712",0,0,"-"]
[51721,"Dani zajmovi županijskim proračunima – kratkoročni","51721",0,0,"-"]
[51722,"Dani zajmovi županijskim proračunima – dugoročni","51722",0,0,"-"]
[51731,"Dani zajmovi gradskim proračunima – kratkoročni","51731",0,0,"-"]
[51732,"Dani zajmovi gradskim proračunima – dugoročni","51732",0,0,"-"]
[51741,"Dani zajmovi općinskim proračunima – kratkoročni","51741",0,0,"-"]
[51742,"Dani zajmovi općinskim proračunima – dugoročni","51742",0,0,"-"]
[51751,"Dani zajmovi HZMO-u, HZZ-u i HZZO-u – kratkoročni","51751",0,0,"-"]
[51752,"Dani zajmovi HZMO-u, HZZ-u i HZZO-u – dugoročni","51752",0,0,"-"]
[51761,"Dani zajmovi ostalim izvanproračunskim korisnicima državnog proračuna – kratkoročni","51761",0,0,"-"]
[51762,"Dani zajmovi ostalim izvanproračunskim korisnicima državnog proračuna – dugoročni","51762",0,0,"-"]
[51771,"Dani zajmovi izvanproračunskim korisnicima županijskih, gradskih i općinskih proračuna – kratkoročni","51771",0,0,"-"]
[51772,"Dani zajmovi izvanproračunskim korisnicima županijskih, gradskih i općinskih proračuna – dugoročni","51772",0,0,"-"]
[54132,"Otplata glavnice primljenih zajmova od međunarodnih organizacija – dugoročnih","54132",0,0,"-"]
[54142,"Otplata glavnice primljenih kredita i zajmova od institucija i tijela EU – dugoročnih","54142",0,0,"-"]
[54152,"Otplata glavnice primljenih zajmova od inozemnih vlada u EU – dugoročnih","54152",0,0,"-"]
[54162,"Otplata glavnice primljenih zajmova od inozemnih vlada izvan EU – dugoročnih","54162",0,0,"-"]
[54221,"Otplata glavnice primljenih kredita od kreditnih institucija u javnom sektoru – kratkoročnih","54221",0,0,"-"]
[54222,"Otplata glavnice primljenih kredita od kreditnih institucija u javnom sektoru – dugoročnih","54222",0,0,"-"]
["54223","Otplata glavnice po financijskom leasingu od kreditnih institucija u javnom sektoru","54223",0,0,"-"]
[54232,"Otplata glavnice primljenih zajmova od osiguravajućih društava u javnom sektoru – dugoročnih","54232",0,0,"-"]
[54242,"Otplata glavnice primljenih zajmova od ostalih financijskih institucija u javnom sektoru – dugoročnih","54242",0,0,"-"]
["54243","Otplata glavnice po financijskom leasingu od ostalih financijskih institucija u javnom sektoru","54243",0,0,"-"]
[54312,"Otplata glavnice primljenih zajmova od trgovačkih društava u javnom sektoru – dugoročnih","54312",0,0,"-"]
[54431,"Otplata glavnice primljenih kredita od tuzemnih kreditnih institucija izvan javnog sektora – kratkoročnih","54431",0,0,"-"]
[54432,"Otplata glavnice primljenih kredita od tuzemnih kreditnih institucija izvan javnog sektora – dugoročnih","54432",0,0,"-"]
["54433","Otplata glavnice po financijskom leasingu od tuzemnih kreditnih institucija izvan javnog sektora","54433",0,0,"-"]
[54442,"Otplata glavnice primljenih zajmova od tuzemnih osiguravajućih društava izvan javnog sektora – dugoročnih","54442",0,0,"-"]
[54452,"Otplata glavnice primljenih zajmova od ostalih tuzemnih financijskih institucija izvan javnog sektora – dugoročnih","54452",0,0,"-"]
["54453","Otplata glavnice po financijskom leasingu od ostalih tuzemnih financijskih institucija izvan javnog sektora","54453",0,0,"-"]
[54461,"Otplata glavnice primljenih kredita od inozemnih kreditnih institucija – kratkoročnih","54461",0,0,"-"]
[54462,"Otplata glavnice primljenih kredita od inozemnih kreditnih institucija – dugoročnih","54462",0,0,"-"]
["54463","Otplata glavnice po financijskom leasingu od inozemnih kreditnih institucija","54463",0,0,"-"]
[54472,"Otplata glavnice primljenih zajmova od inozemnih osiguravajućih društava – dugoročnih","54472",0,0,"-"]
[54482,"Otplata glavnice primljenih zajmova od ostalih inozemnih financijskih institucija – dugoročnih","54482",0,0,"-"]
["54483","Otplata glavnice primljenog financijskog leasinga od ostalih inozemnih financijskih institucija","54483",0,0,"-"]
[54532,"Otplata glavnice primljenih zajmova od tuzemnih trgovačkih društava izvan javnog sektora – dugoročnih","54532",0,0,"-"]
[54542,"Otplata glavnice primljenih zajmova od tuzemnih obrtnika – dugoročnih","54542",0,0,"-"]
[54552,"Otplata glavnice primljenih zajmova od inozemnih trgovačkih društava – dugoročnih","54552",0,0,"-"]
[54711,"Otplata glavnice primljenih zajmova od državnog proračuna – kratkoročnih","54711",0,0,"-"]
[54712,"Otplata glavnice primljenih zajmova od državnog proračuna – dugoročnih","54712",0,0,"-"]
[54721,"Otplata glavnice primljenih zajmova od županijskih proračuna – kratkoročnih","54721",0,0,"-"]
[54722,"Otplata glavnice primljenih zajmova od županijskih proračuna – dugoročnih","54722",0,0,"-"]
[54731,"Otplata glavnice primljenih zajmova od gradskih proračuna – kratkoročnih","54731",0,0,"-"]
[54732,"Otplata glavnice primljenih zajmova od gradskih proračuna – dugoročnih","54732",0,0,"-"]
[54741,"Otplata glavnice primljenih zajmova od općinskih proračuna – kratkoročnih","54741",0,0,"-"]
[54742,"Otplata glavnice primljenih zajmova od općinskih proračuna – dugoročnih","54742",0,0,"-"]
[54751,"Otplata glavnice primljenih zajmova od HZMO-a, HZZ-a i HZZO-a – kratkoročnih","54751",0,0,"-"]
[54752,"Otplata glavnice primljenih zajmova od HZMO-a, HZZ-a i HZZO-a – dugoročnih","54752",0,0,"-"]
[54761,"Otplata glavnice primljenih zajmova od ostalih izvanproračunskih korisnika državnog proračuna – kratkoročnih","54761",0,0,"-"]
[54762,"Otplata glavnice primljenih zajmova od ostalih izvanproračunskih korisnika državnog proračuna – dugoročnih","54762",0,0,"-"]
[54771,"Otplata glavnice primljenih zajmova od izvanproračunskih korisnika županijskih, gradskih i općinskih proračuna – kratkoročnih","54771",0,0,{"$f":"IF(D980<>0,IF(E980/D980>=100,\">>100\",E980/D980*100),\"-\")","v":"-"}]
[54772,"Otplata glavnice primljenih zajmova od izvanproračunskih korisnika županijskih, gradskih i općinskih proračuna – dugoročnih","54772",0,0,"-"]
[55312,"Izdaci za otplatu glavnice za izdane ostale vrijednosne papire u zemlji – dugoročne","55312",0,0,"-"]
["Obvezni dodatni podaci"]
["Račun iz rač. plana","Opis stavke","Šifra","Stanje na kraju prethodne godine","Stanje na kraju izvještajnog razdoblja","Indeks\n(5/4)"]
["26224,26233, 26244,26314","Obveze za zajmove po faktoringu od kreditnih institucija, osiguravajućih društava, ostalih financijskih institucija i trgovačkih društava u javnom sektoru","26224,26233,26244,26314",0,null,{"$f":"IF(D985<>0,IF(E985/D985>=100,\">>100\",E985/D985*100),\"-\")","v":"-"}]
["26243","Obveze za financijski leasing od ostalih financijskih institucija u javnom sektoru","26243",0,null,"-"]
["26453","Obveze za financijski leasing od ostalih tuzemnih financijskih institucija izvan javnog sektora","26453",0,null,"-"]
[26454,"Obveze za zajmove po faktoringu od ostalih tuzemnih financijskih institucija izvan javnog sektora","26454",0,null,"-"]
["26463","Obveze za financijski leasing od inozemnih kreditnih institucija","26463",0,null,"-"]
["26464,26473, 26484,26554, 26564","Obveze za zajmove po faktoringu od inozemnih kreditnih institucija, inozemnih osiguravajućih društava, ostalih inozemnih financijskih institucija, inozemnih trgovačkih društava i inozemnih obrtnika","26464,26473,26484,26554,26564",0,null,"-"]
["26483","Obveze za financijski leasing od ostalih inozemnih financijskih institucija","26483",0,null,"-"]
[26534,"Obveze za zajmove po faktoringu od tuzemnih trgovačkih društava izvan javnog sektora","26534",0,null,"-"]

{"sheet":"BILANCA","index":4,"n_rows":322,"n_cols":6,"rows_kept":322,"cut":false,"hidden":false,"merged":[[1,0,1,5],[260,0,260,1],[4,0,4,1],[173,0,173,1]]}
["Obveznik:",null,"Razina:",null,"Razdoblje:"]
["BILANCA"]
["Račun iz Rač. plana","Opis stavke","Šifra","Stanje 1. siječnja","Stanje 31. prosinca","Indeks\n(5/4)"]
[1,2,"3",4,5,6]
["IMOVINA"]
[null,"IMOVINA (šifre B002+1)","B001",{"$f":"D7+D68","v":77393.370000000039},73517.42,{"$f":"IF(D6>0,IF(E6/D6>=100,\">>100\",E6/D6*100),\"-\")","v":94.991883671689138}]
[0,"Nefinancijska imovina (šifre 01+02+03+04+05+06)","B002",{"$f":"D8+D12+D51+D52+D56+D63","v":66223.130000000034},62411.69,94.244548694693179]
["01","Neproizvedena dugotrajna imovina (šifre 011+012-019)","01",{"$f":"D9+D10-D11","v":0},{"$f":"E9+E10-E11","v":0},"-"]
["011","Materijalna imovina - prirodna bogatstva","011",0,0,"-"]
["012","Nematerijalna imovina ","012",0,0,"-"]
["019","Ispravak vrijednosti neproizvedene dugotrajne imovine","019",0,0,"-"]
["02","Proizvedena dugotrajna imovina (šifre '021 i 02921' + '022 i 02922' + '023 i 02923' + '024 i 02924' + '025 i 02925' + '026 i 02926')","02",{"$f":"D13+D19+D29+D35+D41+D45","v":66223.130000000034},62411.69,94.244548694693179]
["021 i 02921","Građevinski objekti (šifre 0211 do 0214 - 02921)","021 i 02921",{"$f":"SUM(D14:D17)-D18","v":0},0,"-"]
["0211","Stambeni objekti","0211",0,0,"-"]
["0212","Poslovni objekti","0212",0,0,"-"]
["0213","Ceste, željeznice i ostali prometni objekti","0213",0,0,"-"]
["0214","Ostali građevinski objekti","0214",0,0,"-"]
["02921","Ispravak vrijednosti građevinskih objekata","02921",0,0,"-"]
["022 i 02922","Postrojenja i oprema (šifre 0221 do 0228 - 02922)","022 i 02922",{"$f":"SUM(D20:D27)-D28","v":5291.0500000000175},5434.820000000007,102.71723003940596]
["0221","Uredska oprema i namještaj","0221",88887.6,88835.66,99.94156665271646]
["0222","Komunikacijska oprema","0222",4592.1000000000004,4592.1000000000004,100]
["0223","Oprema za održavanje i zaštitu","0223",2714.07,2714.08,100.00036845033473]
["0224","Medicinska i laboratorijska oprema","0224",0,0,"-"]
["0225","Instrumenti, uređaji i strojevi","0225",0,0,"-"]
["0226","Sportska i glazbena oprema","0226",0,0,"-"]
["0227","Uređaji, strojevi i oprema za ostale namjene","0227",2360.0300000000002,2685.04,113.77143510887574]
["0228","Vojna oprema","0228",0,0,"-"]
["02922","Ispravak vrijednosti postrojenja i opreme","02922",93262.75,93392.06,100.13865128360466]
["023 i 02923","Prijevozna sredstva (šifre 0231 do 0234 - 02923)","023 i 02923",{"$f":"SUM(D30:D33)-D34","v":0},0,"-"]
["0231","Prijevozna sredstva u cestovnom prometu","0231",0,0,"-"]
["0232","Prijevozna sredstva u željezničkom prometu ","0232",0,0,"-"]
["0233","Prijevozna sredstva u pomorskom i riječnom prometu","0233",0,0,"-"]
["0234","Prijevozna sredstva u zračnom prometu","0234",0,0,"-"]
["02923","Ispravak vrijednosti prijevoznih sredstava ","02923",0,0,"-"]
["024 i 02924","Knjige, umjetnička djela i ostale izložbene vrijednosti (šifre 0241 do 0244 - 02924)","024 i 02924",{"$f":"SUM(D36:D39)-D40","v":40845.260000000009},47528.119999999995,116.36140888808146]
["0241","Knjige ","0241",289146,313377.13,108.38024043216923]
["0242","Umjetnička djela (izložena u galerijama, muzejima i slično)","0242",0,0,"-"]
["0243","Muzejski izlošci i predmeti prirodnih rijetkosti","0243",0,0,"-"]
["0244","Ostale nespomenute izložbene vrijednosti","0244",0,0,"-"]
["02924","Ispravak vrijednosti knjiga, umjetničkih djela i ostalih izložbenih vrijednosti","02924",248300.74,265849.01,107.06734502684125]
["025 i 02925","Višegodišnji nasadi i osnovno stado (šifre 0251+0252-02925)","025 i 02925",{"$f":"SUM(D42:D43)-D44","v":0},0,"-"]
["0251","Višegodišnji nasadi","0251",0,0,"-"]
["0252","Osnovno stado","0252",0,0,"-"]
["02925","Ispravak vrijednosti višegodišnjih nasada i osnovnog stada","02925",0,0,"-"]
["026 i 02926","Nematerijalna proizvedena imovina (šifre 0261 do 0264 - 02926)","026 i 02926",{"$f":"SUM(D46:D49)-D50","v":20086.82},9448.7500000000036,47.039551307772975]
["0261","Istraživanje rudnih bogatstava","0261",0,0,"-"]
["0262","Ulaganja u računalne programe","0262",6334.93,6334.92,99.999842145059219]
["0263","Umjetnička, literarna i znanstvena djela","0263",26804.959999999999,27467.09,102.47017716124181]
["0264","Ostala nematerijalna proizvedena imovina","0264",33768,0,0]
["02926","Ispravak vrijednosti nematerijalne proizvedene imovine","02926",46821.07,24353.26,52.01346316946622]
["03","Plemeniti metali i ostale pohranjene vrijednosti","03",0,0,"-"]
["04","Sitni inventar i auto gume (šifre 041+042-049)","04",{"$f":"SUM(D53:D54)-D55","v":0},0,"-"]
["041","Zalihe sitnog inventara i auto guma","041",0,0,"-"]
["042","Sitni inventar i auto gume u upotrebi","042",7117.26,7049.65,99.050055779892816]
["049","Ispravak vrijednosti sitnog inventara","049",7117.26,7049.65,99.050055779892816]
["05","Dugotrajna nefinancijska imovina u pripremi (šifre 051 do 056)","05",{"$f":"SUM(D57:D62)","v":0},0,"-"]
["051","Građevinski objekti u pripremi","051",0,0,"-"]
["052","Postrojenja i oprema u pripremi","052",0,0,"-"]
["053","Prijevozna sredstva u pripremi","053",0,0,"-"]
["054","Višegodišnji nasadi i osnovno stado u pripremi","054",0,0,"-"]
["055","Ostala nematerijalna proizvedena imovina u pripremi","055",0,0,"-"]
["056","Ostala nefinancijska dugotrajna imovina u pripremi","056",0,0,"-"]
["06","Proizvedena kratkotrajna imovina (šifre 061 do 064)","06",{"$f":"SUM(D64:D67)","v":0},0,"-"]
["061","Zalihe za obavljanje djelatnosti","061",0,0,"-"]
["062","Proizvodnja i proizvodi","062",0,0,"-"]
["063","Zalihe vojnih sredstava za jednokratnu upotrebu","063",0,0,"-"]
["064","Roba za daljnju prodaju","064",0,0,"-"]
["1","Financijska imovina (šifre 11+12+13+14+15+16+17+19)","1",{"$f":"D69+D78+D87+D118+D134+D146+D164+D170","v":11170.24},11105.73,99.422483312802584]
["11","Novac u banci i blagajni (šifre 111+112 do 114)","11",{"$f":"+D70+D75+D76+D77","v":0},0,"-"]
["111","Novac u banci (šifre 1111 do 1114)","111",{"$f":"SUM(D71:D74)","v":0},0,"-"]
["1111","Novac na računu kod Hrvatske narodne banke","1111",0,0,"-"]
["1112","Novac na računu kod tuzemnih poslovnih banaka","1112",0,0,"-"]
["1113","Novac na računu kod inozemnih poslovnih banaka","1113",0,0,"-"]
["1114","Prijelazni račun","1114",0,0,"-"]
["112","Izdvojena novčana sredstva ","112",0,0,"-"]
["113","Novac u blagajni","113",0,0,"-"]
["114","Vrijednosnice u blagajni","114",0,0,"-"]
["12","Depoziti, jamčevni polozi i potraživanja od zaposlenih te za više plaćene poreze i ostalo (šifre 121 + 122 do 124 - 125 + 129)","12",{"$f":"D79+SUM(D82:D84)-D85+D86","v":82.97},{"$f":"E79+SUM(E82:E84)-E85+E86","v":54.99},66.276967578642882]
["121","Depoziti u kreditnim i ostalim financijskim institucijama (šifre 1211+1212)","121",{"$f":"SUM(D80:D81)","v":0},0,"-"]
["1211","Depoziti u tuzemnim kreditnim i ostalim financijskim institucijama","1211",0,0,"-"]
["1212","Depoziti u inozemnim kreditnim i ostalim financijskim institucijama","1212",0,0,"-"]
["122","Jamčevni polozi","122",0,0,"-"]
["123","Potraživanja od zaposlenih","123",82.97,54.99,66.276967578642882]
["124","Potraživanja za više plaćene poreze i doprinose","124",0,0,"-"]
["125","Ispravak vrijednosti potraživanja od zaposlenih te za više plaćene poreze i ostalo","125",0,0,"-"]
["129","Ostala potraživanja","129",0,0,"-"]
["13","Potraživanja za dane zajmove (šifre 13X1+13X2-139)","13",{"$f":"D88+D106-D117","v":0},0,"-"]
[null,"Zajmovi - tuzemni (šifre 1321+1332+1333+1334+1341+1353+1354+1355+1363+1364+1371+1372+1373+1374+1375+1376+1377)","13X1",{"$f":"SUM(D89:D105)","v":0},0,"-"]
["1321","Zajmovi neprofitnim organizacijama, građanima i kućanstvima u tuzemstvu","1321",0,0,"-"]
["1332","Zajmovi kreditnim institucijama u javnom sektoru","1332",0,0,"-"]
["1333","Zajmovi osiguravajućim društvima u javnom sektoru","1333",0,0,"-"]
["1334","Zajmovi ostalim financijskim institucijama u javnom sektoru","1334",0,0,"-"]
["1341","Zajmovi trgovačkim društvima u javnom sektoru","1341",0,0,"-"]
["1353","Zajmovi tuzemnim kreditnim institucijama izvan javnog sektora","1353",0,0,"-"]
["1354","Zajmovi tuzemnim osiguravajućim društvima izvan javnog sektora","1354",0,0,"-"]
["1355","Zajmovi ostalim tuzemnim financijskim institucijama izvan javnog sektora","1355",0,0,"-"]
["1363","Zajmovi tuzemnim trgovačkim društvima izvan javnog sektora","1363",0,0,"-"]
["1364","Zajmovi tuzemnim obrtnicima","1364",0,0,"-"]
["1371","Zajmovi državnom proračunu","1371",0,0,"-"]
["1372","Zajmovi županijskim proračunima","1372",0,0,"-"]
["1373","Zajmovi gradskim proračunima","1373",0,0,"-"]
["1374","Zajmovi općinskim proračunima","1374",0,0,"-"]
["1375","Zajmovi HZMO-u, HZZ-u, HZZO-u","1375",0,0,"-"]
["1376","Zajmovi ostalim izvanproračunskim korisnicima državnog proračuna","1376",0,0,"-"]
["1377","Zajmovi izvanproračunskim korisnicima županijskih, gradskih i općinskih proračuna","1377",0,0,"-"]
[null,"Zajmovi - inozemni (šifre 1313+1314+1315+1316+1322+1356+1357+1358+1365+1366)","13X2",{"$f":"SUM(D107:D116)","v":0},0,"-"]
["1313","Zajmovi međunarodnim organizacijama ","1313",0,0,"-"]
["1314","Zajmovi institucijama i tijelima EU","1314",0,0,"-"]
["1315","Zajmovi inozemnim vladama u EU","1315",0,0,"-"]
["1316","Zajmovi inozemnim vladama izvan EU","1316",0,0,"-"]
["1322","Zajmovi neprofitnim organizacijama, građanima i kućanstvima u inozemstvu","1322",0,0,"-"]
["1356","Zajmovi inozemnim kreditnim institucijama","1356",0,0,"-"]
["1357","Zajmovi inozemnim osiguravajućim društvima","1357",0,0,"-"]
["1358","Zajmovi ostalim inozemnim financijskim institucijama","1358",0,0,"-"]
["1365","Zajmovi inozemnim trgovačkim društvima","1365",0,0,"-"]
["1366","Zajmovi inozemnim obrtnicima","1366",0,0,"-"]
["139","Ispravak vrijednosti danih zajmova","139",0,0,"-"]
["14","Vrijednosni papiri (šifre 14X1+14X2-149)","14",{"$f":"D119+D126-D133","v":0},0,"-"]
[null,"Vrijednosni papiri - tuzemni (šifre 1411+1421+1431+1441+1451+1461)","14X1",{"$f":"SUM(D120:D125)","v":0},0,"-"]
["1411","Čekovi","1411",0,0,"-"]
["1421","Komercijalni i blagajnički zapisi","1421",0,0,"-"]
["1431","Mjenice","1431",0,0,"-"]
["1441","Obveznice","1441",0,0,"-"]
["1451","Opcije i drugi financijski derivati","1451",0,0,"-"]
["1461","Ostali vrijednosni papiri","1461",0,0,"-"]
[null,"Vrijednosni papiri - inozemni (šifre 1412+1422+1432+1442+1452+1462)","14X2",{"$f":"SUM(D127:D132)","v":0},0,"-"]
["1412","Čekovi","1412",0,0,"-"]
["1422","Komercijalni i blagajnički zapisi","1422",0,0,"-"]
["1432","Mjenice","1432",0,0,"-"]
["1442","Obveznice","1442",0,0,"-"]
["1452","Opcije i drugi financijski derivati","1452",0,0,"-"]
["1462","Ostali vrijednosni papiri","1462",0,0,"-"]
["149","Ispravak vrijednosti vrijednosnih papira","149",0,0,"-"]
["15","Dionice i udjeli u glavnici (šifre 15X1+15X2-159)","15",{"$f":"D135+D142-D145","v":0},0,"-"]
[null,"Dionice i udjeli u glavnici - tuzemni (šifre 1512+1513+1514+1521+1531+1541)","15X1",{"$f":"SUM(D136:D141)","v":0},0,"-"]
["1512","Dionice i udjeli u glavnici kreditnih institucija u javnom sektoru","1512",0,0,"-"]
["1513","Dionice i udjeli u glavnici osiguravajućih društava u javnom sektoru","1513",0,0,"-"]
["1514","Dionice i udjeli u glavnici ostalih financijskih institucija u javnom sektoru","1514",0,0,"-"]
["1521","Dionice i udjeli u glavnici trgovačkih društava u javnom sektoru","1521",0,0,"-"]
["1531","Dionice i udjeli u glavnici tuzemnih kreditnih i ostalih financijskih institucija izvan javnog sektora","1531",0,0,"-"]
["1541","Dionice i udjeli u glavnici tuzemnih trgovačkih društava izvan javnog sektora","1541",0,0,"-"]
[null,"Dionice i udjeli u glavnici - inozemni (šifre 1532+1542)","15X2",{"$f":"SUM(D143:D144)","v":0},0,"-"]
["1532","Dionice i udjeli u glavnici inozemnih kreditnih i ostalih financijskih institucija","1532",0,0,"-"]
["1542","Dionice i udjeli u glavnici inozemnih trgovačkih društava","1542",0,0,"-"]
["159","Ispravak vrijednosti dionica i udjela u glavnici","159",0,0,"-"]
["16","Potraživanja za prihode poslovanja (šifre 161 do 163 + 164 do 168-169)","16",{"$f":"SUM(D147:D149)+SUM(D158:D162)-D163","v":11087.27},11050.74,99.670523041289698]
["161","Potraživanja za poreze","161",0,0,"-"]
["162","Potraživanja za doprinose","162",0,0,"-"]
["163","Potraživanja za pomoći iz inozemstva i od subjekata unutar općeg proračuna (šifre 1631 do 1638)","163",{"$f":"SUM(D150:D157)","v":0},0,"-"]
["1631","Potraživanja za pomoći od inozemnih vlada","1631",0,0,"-"]
["1632","Potraživanja za pomoći od međunarodnih organizacija te institucija i tijela EU","1632",0,0,"-"]
["1633","Potraživanja za pomoći proračunu iz drugih proračuna","1633",0,0,"-"]
["1634","Potraživanja za pomoći od izvanproračunskih korisnika","1634",0,0,"-"]
["1635","Pomoći izravnanja za decentralizirane funkcije","1635",0,0,"-"]
["1636","Potraživanja za pomoći proračunskim korisnicima iz proračuna koji im nije nadležan","1636",0,0,"-"]
["1637","Potraživanja za povrat pomoći danih unutar općeg proračuna po protestiranim jamstvima","1637",0,0,"-"]
["1638","Potraživanja za pomoći iz državnog proračuna temeljem prijenosa EU sredstava","1638",0,0,"-"]
["164","Potraživanja za prihode od imovine","164",0,0,"-"]
["165","Potraživanja za upravne i administrativne pristojbe, pristojbe po posebnim propisima i naknade","165",0,0,"-"]
["166","Potraživanja za prihode od prodaje proizvoda i robe te pruženih usluga i za povrat po protestiranim jamstvima","166",36.5,7.3,20]
["167","Potraživanja proračunskih korisnika za sredstva uplaćena u nadležni proračun i za prihode od HZZO-a na temelju ugovornih obveza","167",11050.77,11043.44,99.933669780476848]
["168","Potraživanja za kazne i upravne mjere te ostale prihode","168",0,0,"-"]
["169","Ispravak vrijednosti potraživanja","169",0,0,"-"]
["17","Potraživanja od prodaje nefinancijske imovine (šifre 171 do 174 - 179)","17",{"$f":"SUM(D165:D168)-D169","v":0},0,"-"]
["171","Potraživanje od prodaje neproizvedene dugotrajne imovine","171",0,0,"-"]
["172","Potraživanja od prodaje proizvedene dugotrajne imovine","172",0,0,"-"]
["173","Potraživanja od prodaje plemenitih metala i ostalih pohranjenih vrijednosti","173",0,0,"-"]
["174","Potraživanja  od prodaje proizvedene kratkotrajne imovine","174",0,0,"-"]
["179","Ispravak vrijednosti potraživanja za prodanu nefinancijsku imovinu","179",0,0,"-"]
["19","Rashodi budućih razdoblja i nedospjela naplata prihoda (šifre 191 do 193)","19",{"$f":"SUM(D171:D173)","v":0},0,"-"]
["191","Rashodi budućih razdoblja","191",0,0,"-"]
["192","Nedospjela naplata prihoda","192",0,0,"-"]
["193","Kontinuirani rashodi budućih razdoblja","193",0,0,"-"]
["OBVEZE I VLASTITI IZVORI"]
[null,"OBVEZE I VLASTITI IZVORI (šifre 2+9)","B003",{"$f":"D176+D237","v":77393.37},73517.420000000013,94.991883671689209]
["2","Obveze (šifre 23+24+25+26+29) ","2",{"$f":"D177+D189+D190+D206+D234","v":4503.8100000000004},5561.88,123.49277611622158]
["23","Obveze za rashode poslovanja (šifre 231 do 234 + 235 do 239)","23",{"$f":"SUM(D178:D180)+SUM(D184:D188)","v":4503.8100000000004},5143.8900000000003,114.21196720110306]
["231","Obveze za zaposlene","231",3872.57,4499.22,116.18176043299411]
["232","Obveze za materijalne rashode","232",631.24,644.66999999999996,102.12755845637159]
["234","Obveze za financijske rashode (šifre 2341 do 2343)","234",{"$f":"SUM(D181:D183)","v":0},0,"-"]
["2341","Obveze za kamate za izdane vrijednosne papire","2341",0,0,"-"]
["2342","Obveze za kamate na primljene kredite i zajmove","2342",0,0,"-"]
["2343","Obveze za ostale financijske rashode","2343",0,0,"-"]
["235","Obveze za subvencije","235",0,0,"-"]
["236","Obveze za povrat pomoći primljenih unutar općeg proračuna po protestiranim jamstvima","236",0,0,"-"]
["237","Obveze za naknade građanima i kućanstvima","237",0,0,"-"]
["238","Obveze za kazne, naknade šteta i kapitalne pomoći","238",0,0,"-"]
["239","Ostale tekuće obveze","239",0,0,"-"]
["24","Obveze za nabavu nefinancijske imovine","24",0,417.99,"-"]
["25","Obveze za vrijednosne papire (šifre 25X1+25X2-259)","25",{"$f":"D191+D198-D205","v":0},0,"-"]
[null,"Obveze za vrijednosne papire - tuzemne (šifre 2511+2521+2531+2541+2551+2561)","25X1",{"$f":"SUM(D192:D197)","v":0},0,"-"]
["2511","Obveze za čekove","2511",0,0,"-"]
["2521","Obveze za trezorske zapise","2521",0,0,"-"]
["2531","Obveze za mjenice","2531",0,0,"-"]
["2541","Obveze za obveznice","2541",0,0,"-"]
["2551","Obveze za opcije i druge financijske derivate","2551",0,0,"-"]
["2561","Obveze za ostale vrijednosne papire","2561",0,0,"-"]
[null,"Obveze za vrijednosne papire - inozemne (šifre 2512+2522+2532+2542+2552+2562) ","25X2",{"$f":"SUM(D199:D204)","v":0},0,"-"]
["2512","Obveze za čekove","2512",0,0,"-"]
["2522","Obveze za trezorske zapise","2522",0,0,"-"]
["2532","Obveze za mjenice","2532",0,0,"-"]
["2542","Obveze za obveznice","2542",0,0,"-"]
["2552","Obveze za opcije i druge financijske derivate","2552",0,0,"-"]
["2562","Obveze za ostale vrijednosne papire","2562",0,0,"-"]
["259","Ispravak vrijednosti obveza za vrijednosne papire","259",0,0,"-"]
["26","Obveze za kredite i zajmove (šifre 26X1+26X2)","26",{"$f":"D207+D224","v":0},0,"-"]
[null,"Obveze za kredite i zajmove - tuzemne (šifre 2622+2623+2624+2631+2643+2644+2645+2653+2654+2671+2672+2673+2674+2675+2676+2677)","26X1",{"$f":"SUM(D208:D223)","v":0},0,"-"]
["2622","Obveze za kredite od kreditnih institucija u javnom sektoru","2622",0,0,"-"]
["2623","Obveze za zajmove od osiguravajućih društava u javnom sektoru","2623",0,0,"-"]
["2624","Obveze za zajmove od ostalih financijskih institucija u javnom sektoru","2624",0,0,"-"]
["2631","Obveze za zajmove od trgovačkih društava u javnom sektoru","2631",0,0,"-"]
["2643","Obveze za kredite od tuzemnih kreditnih institucija izvan javnog sektora","2643",0,0,"-"]
["2644","Obveze za zajmove od tuzemnih osiguravajućih društava izvan javnog sektora","2644",0,0,"-"]
["2645","Obveze za zajmove od ostalih tuzemnih financijskih institucija izvan javnog sektora","2645",0,0,"-"]
["2653","Obveze za zajmove od tuzemnih trgovačkih društava izvan javnog sektora","2653",0,0,"-"]
["2654","Obveze za zajmove od tuzemnih obrtnika","2654",0,0,"-"]
["2671","Obveze za zajmove od državnog proračuna","2671",0,0,"-"]
["2672","Obveze za zajmove od županijskih proračuna","2672",0,0,"-"]
["2673","Obveze za zajmove od gradskih proračuna","2673",0,0,"-"]
["2674","Obveze za zajmove od općinskih proračuna","2674",0,0,"-"]
["2675","Obveze za zajmove od HZMO-a, HZZ-a i HZZO-a","2675",0,0,"-"]
["2676","Obveze za zajmove od ostalih izvanproračunskih korisnika državnog proračuna","2676",0,0,"-"]
["2677","Obveze za zajmove od izvanproračunskih korisnika županijskih, gradskih i općinskih proračuna","2677",0,0,"-"]
[null,"Obveze za kredite i zajmove - inozemne (šifre 2613+2614+2615+2616+2646+2647+2648+2655+2656)","26X2",{"$f":"SUM(D225:D233)","v":0},0,"-"]
["2613","Obveze za zajmove od međunarodnih organizacija","2613",0,0,"-"]
["2614","Obveze za kredite i zajmove od institucija i tijela EU","2614",0,0,"-"]
[2615,"Obveze za zajmove od inozemnih vlada u EU","2615",0,0,"-"]
[2616,"Obveze za zajmove od inozemnih vlada izvan EU","2616",0,0,"-"]
[2646,"Obveze za kredite od inozemnih kreditnih institucija","2646",0,0,"-"]
[2647,"Obveze za zajmove od inozemnih osiguravajućih društava","2647",0,0,"-"]
[2648,"Obveze za zajmove od ostalih inozemnih financijskih institucija","2648",0,0,"-"]
[2655,"Obveze za zajmove od inozemnih trgovačkih društava","2655",0,0,"-"]
[2656,"Obveze za zajmove od inozemnih obrtnika","2656",0,0,"-"]
["29","Odgođeno plaćanje rashoda i prihodi budućih razdoblja (šifre 291+292)","29",{"$f":"SUM(D235:D236)","v":0},0,"-"]
["291","Odgođeno plaćanje rashoda","291",0,0,"-"]
["292","Naplaćeni prihodi budućih razdoblja","292",0,0,"-"]
["9","Vlastiti izvori (šifre 91 + 922 - 93 + 96 do 98)","9",{"$f":"+D238+D245-D254+SUM(D255:D257)","v":72889.56},67955.540000000008,93.23082756981934]
["91","Vlastiti izvori i ispravak vlastitih izvora (šifre 911-912)","91",{"$f":"D239-D242","v":66223.13},62411.69,94.244548694693236]
["911","Vlastiti izvori (šifre 9111+9112)","911",{"$f":"SUM(D240:D241)","v":66223.13},62411.69,94.244548694693236]
["9111","Vlastiti izvori iz proračuna","9111",66223.13,62411.69,94.244548694693236]
["9112","Ostali vlastiti izvori","9112",0,0,"-"]
["912","Ispravak vlastitih izvora za obveze (šifre 9121+9122)","912",{"$f":"SUM(D243:D244)","v":0},0,"-"]
["9121","Ispravak vlastitih izvora iz proračuna za obveze","9121",0,0,"-"]
["9122","Ispravak ostalih vlastitih izvora za obveze","9122",0,0,"-"]
["922","Višak/manjak prihoda (šifre 9221-9222)","922",{"$f":"D246-D250","v":6629.9299999999985},5536.5499999999993,83.508423165855447]
["9221","Višak prihoda (šifre 92211 do 92213)","9221",{"$f":"SUM(D247:D249)","v":18475.689999999999},7138.74,38.638556936168555]
["92211","Višak prihoda poslovanja","92211",18475.689999999999,7138.74,38.638556936168555]
["92212","Višak prihoda od nefinancijske imovine","92212",0,0,"-"]
["92213","Višak primitaka od financijske imovine","92213",0,0,"-"]
["9222","Manjak prihoda (šifre 92221 do 92223)","9222",{"$f":"SUM(D251:D253)","v":11845.76},1602.19,13.525430196120805]
["92221","Manjak prihoda poslovanja","92221",0,0,"-"]
["92222","Manjak prihoda od nefinancijske imovine","92222",11845.76,1602.19,13.525430196120805]
["92223","Manjak primitaka od financijske imovine","92223",0,0,"-"]
["93","Obračunati rashodi poslovanja","93",0,0,"-"]
["96","Obračunati prihodi poslovanja","96",36.5,7.3,20]
["97","Obračunati prihodi od prodaje nefinancijske imovine","97",0,0,"-"]
["98","Rezerviranja viška prihoda","98",0,0,"-"]
["99","Izvanbilančni zapisi (=0)","99",{"$f":"+D259-D260","v":0},0,"-"]
["991","Izvanbilančni zapisi - aktiva (šifra 996)","991",{"$f":"D260","v":0},0,"-"]
["996","Izvanbilančni zapisi - pasiva","996",0,0,"-"]
["Obvezni analitički podaci"]
["dio 13","Potraživanja za dane zajmove - dospjela","dio 13 D",0,0,{"$f":"IF(D262>0,IF(E262/D262>=100,\">>100\",E262/D262*100),\"-\")","v":"-"}]
["dio 13","Potraživanja za dane zajmove - nedospjela","dio 13 N",0,0,"-"]
["dio 16","Potraživanja za prihode poslovanja - dospjela","dio 16 D",36.5,7.3,20]
["dio 16","Potraživanja za prihode poslovanja - nedospjela","dio 16 N",11050.77,11043.44,99.933669780476848]
["dio 17","Potraživanja od prodaje nefinancijske imovine - dospjela","dio 17 D",0,0,"-"]
["dio 17","Potraživanja od prodaje nefinancijske imovine - nedospjela","dio 17 N",0,0,"-"]
["12911","Potraživanja za naknade koje se refundiraju","12911",0,0,"-"]
["12912","Potraživanja za predujmove","12912",0,0,"-"]
["12913","Potraživanja za dane predujmove za EU projekte","12913",0,0,"-"]
["12921","Ostala nespomenuta potraživanja","12921",0,0,"-"]
["12931","Potraživanja za prodana potraživanja (faktoring)","12931",0,0,"-"]
["12941","Potraživanja proračuna od proračunskih korisnika za povrat u nadležni proračun","12941",0,0,"-"]
[16371,"Potraživanja za povrat pomoći danih proračunskim korisnicima državnog proračuna po protestiranim jamstvima",16371,0,0,"-"]
[16372,"Potraživanja za povrat pomoći danih proračunskim korisnicima županijskih, gradskih i općinskih proračuna po protestiranim jamstvima",16372,0,0,"-"]
[16373,"Potraživanja za povrat pomoći danih županijskim proračunima po protestiranim jamstvima",16373,0,0,"-"]
[16374,"Potraživanja za povrat pomoći danih gradskim proračunima po protestiranim jamstvima",16374,0,0,"-"]
[16375,"Potraživanja za povrat pomoći danih općinskim proračunima po protestiranim jamstvima",16375,0,0,"-"]
[16376,"Potraživanja za povrat pomoći danih HZMO-u, HZZ-u i HZZO-u po protestiranim jamstvima",16376,0,0,"-"]
[16377,"Potraživanja za povrat pomoći danih ostalim izvanproračunskim korisnicima državnog proračuna po protestiranim jamstvima",16377,0,0,"-"]
[16378,"Potraživanja za povrat pomoći danih izvanproračunskim korisnicima županijskih, gradskih i općinskih proračuna po protestiranim jamstvima",16378,0,0,"-"]
["16631","Potraživanja za povrat donacija danih neprofitnim organizacijama, građanima i kućanstvima u tuzemstvu po protestiranim jamstvima","16631",0,0,"-"]
["16641","Potraživanja za povrat kapitalnih pomoći danih trgovačkim društvima u javnom sektoru po protestiranim jamstvima","16641",0,0,"-"]
["16642","Potraživanja za povrat kapitalnih pomoći danih tuzemnim trgovačkim društvima izvan javnog sektora po protestiranim jamstvima","16642",0,0,"-"]
["16643","Potraživanja za povrat kapitalnih pomoći danih tuzemnim obrtnicima po protestiranim jamstvima","16643",0,0,"-"]
["16721","Potraživanja proračunskih korisnika za sredstva uplaćena u nadležni proračun","16721",11050.77,11043.44,99.933669780476848]
["dio 23","Obveze za rashode poslovanja - dospjele","dio 23 D",0,0,"-"]
["dio 23","Obveze za rashode poslovanja - nedospjele","dio 23 N",4503.8100000000004,5143.8900000000003,114.21196720110306]
["dio 24","Obveze za nabavu nefinancijske imovine - dospjele","dio 24 D",0,0,"-"]
["dio 24","Obveze za nabavu nefinancijske imovine - nedospjele","dio 24 N",0,417.99,"-"]
["dio 25","Obveze za vrijednosne papire - dospjele","dio 25 D",0,0,"-"]
["dio 25","Obveze za vrijednosne papire - nedospjele","dio 25 N",0,0,"-"]
["dio 26","Obveze za kredite i zajmove - dospjele","dio 26 D",0,0,"-"]
["dio 26","Obveze za kredite i zajmove - nedospjele","dio 26 N",0,0,"-"]
["23951","Obveze za predujmove","23951",0,0,"-"]
["23952","Obveze za depozite","23952",0,0,"-"]
["23953","Obveze za jamčevine","23953",0,0,"-"]
[23954,"Ostale nespomenute obveze","23954",0,0,"-"]
[23955,"Obveze za naplaćene tuđe prihode ","23955",0,0,"-"]
[23956,"Obveze proračuna za naplaćena sredstva proračunskog korisnika","23956",0,0,"-"]
[23957,"Obveze za EU predujmove","23957",0,0,"-"]
[23958,"Obveze proračunskih korisnika za povrat u proračun","23958",0,0,"-"]
["26223","Obveze za financijski leasing od kreditnih institucija u javnom sektoru","26223",0,0,"-"]
[26224,"Obveze za zajmove po faktoringu od kreditnih institucija u javnom sektoru","26224",0,0,"-"]
[26233,"Obveze za zajmove po faktoringu od osiguravajućih društava u javnom sektoru","26233",0,0,"-"]
["26243","Obveze za financijski leasing od ostalih financijskih institucija u javnom sektoru","26243",0,0,"-"]
[26244,"Obveze za zajmove po faktoringu od ostalih financijskih institucija u javnom sektoru","26244",0,0,"-"]
[26314,"Obveze za zajmove po faktoringu od trgovačkih društava u javnom sektoru","26314",0,0,"-"]
["26433","Obveze za financijski leasing od tuzemnih kreditnih institucija izvan javnog sektora","26433",0,0,"-"]
[26434,"Obveze za zajmove po faktoringu od tuzemnih kreditnih institucija izvan javnog sektora","26434",0,0,"-"]
[26443,"Obveze za zajmove po faktoringu od tuzemnih osiguravajućih društava izvan javnog sektora","26443",0,0,"-"]
["26453","Obveze za financijski leasing od ostalih tuzemnih financijskih institucija izvan javnog sektora","26453",0,0,"-"]
[26454,"Obveze za zajmove po faktoringu od ostalih tuzemnih financijskih institucija izvan javnog sektora","26454",0,0,"-"]
["26463","Obveze za financijski leasing od inozemnih kreditnih institucija","26463",0,0,"-"]
[26464,"Obveze za zajmove po faktoringu od inozemnih kreditnih institucija","26464",0,0,"-"]
[26473,"Obveze za zajmove po faktoringu od inozemnih osiguravajućih društava","26473",0,0,"-"]
["26483","Obveze za financijski leasing od ostalih inozemnih financijskih institucija","26483",0,0,"-"]
[26484,"Obveze za zajmove po faktoringu od ostalih inozemnih financijskih institucija","26484",0,0,"-"]
[26534,"Obveze za zajmove po faktoringu od tuzemnih trgovačkih društava izvan javnog sektora","26534",0,0,"-"]
[26544,"Obveze za zajmove po faktoringu od tuzemnih obrtnika","26544",0,0,"-"]
[26554,"Obveze za zajmove po faktoringu od inozemnih trgovačkih društava","26554",0,0,"-"]
[26564,"Obveze za zajmove po faktoringu od inozemnih obrtnika","26564",0,0,"-"]

{"sheet":"RAS-funkcijski","index":5,"n_rows":141,"n_cols":6,"rows_kept":141,"cut":false,"hidden":false,"merged":[[1,0,1,5],[142,3,142,4]]}
["Obveznik:",null,"Razina:",null,"Razdoblje:"]
["IZVJEŠTAJ O RASHODIMA PREMA FUNKCIJSKOJ KLASIFIKACIJI"]
["Brojč. ozn. funk. klas.","Opis stavke","Šifra","Ostvareno u izvještajnom razdoblju preth. godine","Ostvareno u izvještajnom razdoblju \ntekuće godine","Indeks\n(5/4)"]
[1,2,"3",4,5,6]
["01","Opće javne usluge (šifre 011+012+013+014 do 018)","01",{"$f":"D6+D10+D13+SUM(D17:D21)","v":0},0,{"$f":"IF(D5>0,IF(E5/D5>=100,\">>100\",E5/D5*100),\"-\")","v":"-"}]
["011","Izvršna i zakonodavna tijela, financijski i fiskalni poslovi, vanjski poslovi (šifre 0111 do 0113)","011",{"$f":"SUM(D7:D9)","v":0},0,"-"]
["0111","Izvršna i zakonodavna tijela","0111",null,null,"-"]
["0112","Financijski i fiskalni poslovi","0112",null,null,"-"]
["0113","Vanjski poslovi","0113",null,null,"-"]
["012","Inozemna ekonomska pomoć (šifre 0121+0122)","012",{"$f":"SUM(D11:D12)","v":0},0,"-"]
["0121","Ekonomska pomoć zemljama u razvoju i zemljama u tranziciji","0121",null,null,"-"]
["0122","Ekonomska pomoć usmjerena preko međunarodnih agencija","0122",0,0,"-"]
["013","Opće usluge (šifre 0131 do 0133)","013",{"$f":"SUM(D14:D16)","v":0},0,"-"]
["0131","Opće usluge vezane za službenike","0131",0,0,"-"]
["0132","Sveukupno planiranje i statističke usluge","0132",0,0,"-"]
["0133","Ostale opće usluge","0133",0,0,"-"]
["014","Osnovna istraživanja","014",0,0,"-"]
["015","Istraživanje i razvoj: Opće javne usluge","015",0,0,"-"]
["016","Opće javne usluge koje nisu drugdje svrstane","016",0,0,"-"]
["017","Transakcije vezane za javni dug","017",0,0,"-"]
["018","Prijenosi općeg karaktera između različitih državnih razina","018",0,0,"-"]
["02","Obrana (šifre 021 do 025)","02",{"$f":"SUM(D23:D27)","v":0},0,"-"]
["021","Vojna obrana","021",0,0,"-"]
["022","Civilna obrana","022",0,0,"-"]
["023","Inozemna vojna pomoć","023",0,0,"-"]
["024","Istraživanje i razvoj obrane","024",0,0,"-"]
["025","Rashodi za obranu koji nisu drugdje svrstani","025",0,0,"-"]
["03","Javni red i sigurnost (šifre 031 do 036)","03",{"$f":"SUM(D29:D34)","v":0},0,"-"]
["031","Usluge policije","031",0,0,"-"]
["032","Usluge protupožarne zaštite","032",0,0,"-"]
["033","Sudovi","033",0,0,"-"]
["034","Zatvori","034",0,0,"-"]
["035","Istraživanje i razvoj: Javni red i sigurnost","035",0,0,"-"]
["036","Rashodi za javni red i sigurnost koji nisu drugdje svrstani","036",0,0,"-"]
["04","Ekonomski poslovi (šifre 041+042+043+044+045+046+047+048+049)","04",{"$f":"D36+D39+D43+D50+D54+D60+D61+D66+D74","v":0},0,"-"]
["041","Opći ekonomski, trgovački i poslovi vezani uz rad (šifre 0411+0412) ","041",{"$f":"SUM(D37:D38)","v":0},0,"-"]
["0411","Opći ekonomski i trgovački poslovi","0411",0,0,"-"]
["0412","Opći poslovi vezani uz rad","0412",0,0,"-"]
["042","Poljoprivreda, šumarstvo, ribarstvo i lov (šifre 0421 do 0423)","042",{"$f":"SUM(D40:D42)","v":0},0,"-"]
["0421","Poljoprivreda","0421",0,0,"-"]
["0422","Šumarstvo","0422",0,0,"-"]
["0423","Ribarstvo i lov","0423",0,0,"-"]
["043","Gorivo i energija (šifre 0431 do 0436)","043",{"$f":"SUM(D44:D49)","v":0},0,"-"]
["0431","Ugljen i ostala kruta mineralna goriva","0431",0,0,"-"]
["0432","Nafta i prirodni plin","0432",0,0,"-"]
["0433","Nuklearno gorivo","0433",0,0,"-"]
["0434","Ostala goriva","0434",0,0,"-"]
["0435","Električna energija","0435",0,0,"-"]
["0436","Ostale vrste energije","0436",0,0,"-"]
["044","Rudarstvo, proizvodnja i građevinarstvo (šifre 0441 do 0443)","044",{"$f":"SUM(D51:D53)","v":0},0,"-"]
["0441","Rudarstvo, mineralni resursi i ostala mineralna goriva","0441",0,0,"-"]
["0442","Proizvodnja ","0442",0,0,"-"]
["0443","Građevinarstvo","0443",0,0,"-"]
["045","Promet (šifre 0451 do 0455)","045",{"$f":"SUM(D55:D59)","v":0},0,"-"]
["0451","Cestovni promet","0451",0,0,"-"]
["0452","Promet vodnim putovima","0452",0,0,"-"]
["0453","Željeznički promet","0453",0,0,"-"]
["0454","Zračni promet","0454",0,0,"-"]
["0455","Promet cjevovodima i ostali promet","0455",0,0,"-"]
["046","Komunikacije","046",0,0,"-"]
["047","Ostale industrije (šifre 0471 do 0474)","047",{"$f":"SUM(D62:D65)","v":0},0,"-"]
["0471","Distribucija i skladištenje","0471",0,0,"-"]
["0472","Hoteli i restorani","0472",0,0,"-"]
["0473","Turizam","0473",0,0,"-"]
["0474","Višenamjenski razvojni projekti","0474",0,0,"-"]
["048","Istraživanje i razvoj: Ekonomski poslovi (šifre 0481 do 0487)","048",{"$f":"SUM(D67:D73)","v":0},0,"-"]
["0481","Istraživanje i razvoj: Opći ekonomski, trgovački i poslovi vezani uz rad","0481",0,0,"-"]
["0482","Istraživanje i razvoj: Poljoprivreda, šumarstvo, ribarstvo i lov","0482",0,0,"-"]
["0483","Istraživanje i razvoj: Gorivo i energija","0483",0,0,"-"]
["0484","Istraživanje i razvoj: Rudarstvo, proizvodnja i građevinarstvo","0484",0,0,"-"]
["0485","Istraživanje i razvoj: Promet","0485",0,0,"-"]
["0486","Istraživanje i razvoj: Komunikacije","0486",0,0,"-"]
["0487","Istraživanje i razvoj: Ostale industrije","0487",0,0,"-"]
["049","Ekonomski poslovi koji nisu drugdje svrstani","049",0,0,"-"]
["05","Zaštita okoliša (šifre 051 do 056)","05",{"$f":"SUM(D76:D81)","v":0},0,"-"]
["051","Gospodarenje otpadom","051",0,0,"-"]
["052","Gospodarenje otpadnim vodama","052",0,0,"-"]
["053","Smanjenje zagađivanja","053",0,0,"-"]
["054","Zaštita bioraznolikosti i krajolika","054",0,0,"-"]
["055","Istraživanje i razvoj: Zaštita okoliša","055",0,0,"-"]
["056","Poslovi i usluge zaštite okoliša koji nisu drugdje svrstani","056",0,0,"-"]
["06","Usluge unapređenja stanovanja i zajednice (šifre 061 do 066)","06",{"$f":"SUM(D83:D88)","v":0},0,"-"]
["061","Razvoj stanovanja","061",0,0,"-"]
["062","Razvoj zajednice","062",0,0,"-"]
["063","Opskrba vodom","063",0,0,"-"]
["064","Ulična rasvjeta","064",0,0,"-"]
["065","Istraživanje i razvoj stanovanja i komunalnih pogodnosti","065",0,0,"-"]
["066","Rashodi vezani za stanovanje i kom. pogodnosti koji nisu drugdje svrstani","066",0,0,"-"]
["07","Zdravstvo (šifre 071+072+073+074+075+076)","07",{"$f":"D90+D94+D99+D104+D105+D106","v":0},0,"-"]
["071","Medicinski proizvodi, pribor i oprema (šifre 0711 do 0713)","071",{"$f":"SUM(D91:D93)","v":0},0,"-"]
["0711","Farmaceutski proizvodi","0711",0,0,"-"]
["0712","Ostali medicinski proizvodi","0712",0,0,"-"]
["0713","Terapeutski pribor i oprema","0713",0,0,"-"]
["072","Službe za vanjske pacijente (šifre 0721 do 0724)","072",{"$f":"SUM(D95:D98)","v":0},0,"-"]
["0721","Opće medicinske usluge","0721",0,0,"-"]
["0722","Specijalističke medicinske usluge","0722",0,0,"-"]
["0723","Zubarske usluge","0723",0,0,"-"]
["0724","Paramedicinske usluge ","0724",0,0,"-"]
["073","Bolničke službe (šifre 0731 do 0734)","073",{"$f":"SUM(D100:D103)","v":0},0,"-"]
["0731","Usluge općih bolnica","0731",0,0,"-"]
["0732","Usluge specijalističkih bolnica","0732",0,0,"-"]
["0733","Usluge medicinskih centara i centara za majčinstvo","0733",0,0,"-"]
["0734","Usluge centara za njegu i oporavak","0734",0,0,"-"]
["074","Službe javnog zdravstva","074",0,0,"-"]
["075","Istraživanje i razvoj zdravstva","075",0,0,"-"]
["076","Poslovi i usluge zdravstva koji nisu drugdje svrstani","076",0,0,"-"]
["08","Rekreacija, kultura i religija (šifre 081 do 086)","08",{"$f":"SUM(D108:D113)","v":94377.54},113277.49,120.02589811092767]
["081","Službe rekreacije i sporta","081",0,0,"-"]
["082","Službe kulture","082",94377.54,113277.49,120.02589811092767]
["083","Službe emitiranja i izdavanja","083",0,0,"-"]
["084","Religijske i druge službe zajednice","084",0,0,"-"]
["085","Istraživanje i razvoj rekreacije, kulture i religije","085",0,0,"-"]
["086","Rashodi za rekreaciju, kulturu i religiju koji nisu drugdje svrstani","086",0,0,"-"]
["09","Obrazovanje (šifre 091+092+093+094+095+096+097+098)","09",{"$f":"D115+D118+D121+D122+SUM(D125:D128)","v":0},0,"-"]
["091","Predškolsko i osnovno obrazovanje (šifre 0911+0912)","091",{"$f":"SUM(D116:D117)","v":0},0,"-"]
["0911","Predškolsko obrazovanje","0911",0,0,"-"]
["0912","Osnovno obrazovanje","0912",0,0,"-"]
["092","Srednjoškolsko obrazovanje (šifre 0921+0922)","092",{"$f":"SUM(D119:D120)","v":0},0,"-"]
["0921","Niže srednjoškolsko obrazovanje","0921",0,0,"-"]
["0922","Više srednjoškolsko obrazovanje","0922",0,0,"-"]
["093","Poslije srednjoškolsko, ali ne visoko obrazovanje","093",0,0,"-"]
["094","Visoka naobrazba (šifre 0941+0942)","094",{"$f":"SUM(D123:D124)","v":0},0,"-"]
["0941","Prvi stupanj visoke naobrazbe","0941",0,0,"-"]
["0942","Drugi stupanj visoke naobrazbe","0942",0,0,"-"]
["095","Obrazovanje koje se ne može definirati po stupnju","095",0,0,"-"]
["096","Dodatne usluge u obrazovanju","096",0,0,"-"]
["097","Istraživanje i razvoj obrazovanja","097",0,0,"-"]
["098","Usluge obrazovanja koje nisu drugdje svrstane","098",0,0,"-"]
["10","Socijalna zaštita (šifre 101+102+103+104+105+106+107+108+109)","10",{"$f":"D130+D133+SUM(D134:D140)","v":0},0,"-"]
["101","Bolest i invaliditet (šifre 1011+1012)","101",{"$f":"SUM(D131:D132)","v":0},0,"-"]
["1011","Bolest","1011",0,0,"-"]
["1012","Invaliditet","1012",0,0,"-"]
["102","Starost","102",0,0,"-"]
["103","Slijednici","103",0,0,"-"]
["104","Obitelj i djeca","104",0,0,"-"]
["105","Nezaposlenost","105",0,0,"-"]
["106","Stanovanje","106",0,0,"-"]
["107","Socijalna pomoć stanovništvu koje nije obuhvaćeno redovnim socijalnim programima","107",0,0,"-"]
["108","Istraživanje i razvoj socijalne zaštite","108",0,0,"-"]
["109","Aktivnosti socijalne zaštite koje nisu drugdje svrstane","109",0,0,"-"]
[null,"Kontrolni zbroj (šifre 01+02+03+04+05+06+07+08+09+10)","R1",{"$f":"D5+D22+D28+D35+D75+D82+D89+D107+D114+D129","v":94377.54},113277.49,120.02589811092767]

{"sheet":"P-VRIO","index":6,"n_rows":48,"n_cols":5,"rows_kept":48,"cut":false,"hidden":false,"merged":[[1,0,1,4],[50,3,50,4]]}
["Obveznik:",null,"Razina:",null,"Razdoblje:"]
["IZVJEŠTAJ O PROMJENAMA U VRIJEDNOSTI\nI OBUJMU IMOVINE I OBVEZA"]
["Račun iz rač. plana","Opis stavke","Šifra","Iznos povećanja","Iznos smanjenja"]
[1,2,"3",4,5]
["9151","Promjene u vrijednosti i obujmu imovine (šifre 91511+91512)","9151",{"$f":"D6+D22","v":6840.64},3347.3]
["91511","Promjene u vrijednosti (revalorizacija) imovine (šifre P001+P008)","91511",{"$f":"D7+D14","v":0},3305.61]
[" ","Promjene u vrijednosti (revalorizacija) nefinancijske imovine (šifre P002 do P007)","P001",{"$f":"SUM(D8:D13)","v":0},3305.61]
[" ","Neproizvedena dugotrajna imovina","P002",null,3305.61]
[" ","Proizvedena dugotrajna imovina","P003"]
[" ","Plemeniti metali i ostale pohranjene vrijednosti","P004"]
[" ","Sitni inventar i auto gume","P005"]
[" ","Dugotrajna nefinancijska imovina u pripremi","P006"]
[" ","Proizvedena kratkotrajna imovina","P007"]
[" ","Promjene u vrijednosti (revalorizacija) financijske imovine (šifre P009 do P015)","P008",{"$f":"SUM(D15:D21)","v":0},{"$f":"SUM(E15:E21)","v":0}]
[" ","Novac u banci i blagajni","P009"]
[" ","Depoziti, jamčevni polozi i potraživanja od zaposlenih te za više plaćene poreze i ostalo","P010"]
[" ","Potraživanja za dane zajmove ","P011"]
[" ","Vrijednosni papiri","P012"]
[" ","Dionice i udjeli u glavnici","P013"]
[" ","Potraživanja za prihode poslovanja","P014"]
[" ","Potraživanja od prodaje nefinancijske imovine","P015"]
["91512","Promjene u obujmu imovine (šifre P016+P023)","91512",{"$f":"D23+D30","v":6840.64},41.69]
[" ","Promjene u obujmu nefinancijske imovine (šifre P017 do P022)","P016",{"$f":"SUM(D24:D29)","v":6840.64},41.69]
[" ","Neproizvedena dugotrajna imovina","P017"]
[" ","Proizvedena dugotrajna imovina","P018",6840.64,41.69]
[" ","Plemeniti metali i ostale pohranjene vrijednosti","P019"]
[" ","Sitni inventar i auto gume","P020"]
[" ","Dugotrajna nefinancijska imovina u pripremi","P021"]
[" ","Proizvedena kratkotrajna imovina","P022"]
[" ","Promjene u obujmu financijske imovine (šifre P024 do P030)","P023",{"$f":"SUM(D31:D37)","v":0},{"$f":"SUM(E31:E37)","v":0}]
[" ","Novac u banci i blagajni","P024"]
[" ","Depoziti, jamčevni polozi i potraživanja od zaposlenih te za više plaćene poreze i ostalo","P025"]
[" ","Potraživanja za dane zajmove ","P026"]
[" ","Vrijednosni papiri","P027"]
[" ","Dionice i udjeli u glavnici","P028"]
[" ","Potraživanja za prihode poslovanja","P029"]
[" ","Potraživanja od prodaje nefinancijske imovine","P030"]
["9152","Promjene u vrijednosti (revalorizacija) i obujmu obveza (šifre 91521+91522)","9152",{"$f":"D39+D44","v":0},{"$f":"E39+E44","v":0}]
["91521","Promjene u vrijednosti (revalorizacija) obveza (šifre P031 do P034)","91521",{"$f":"SUM(D40:D43)","v":0},0]
[" ","Obveze za rashode poslovanja","P031"]
[" ","Obveze za nabavu nefinancijske imovine","P032"]
[" ","Obveze za vrijednosne papire","P033"]
[" ","Obveze za kredite i zajmove","P034"]
["91522","Promjene u obujmu obveza (šifre P035 do P038)","91522",{"$f":"SUM(D45:D48)","v":0},0]
[" ","Obveze za rashode poslovanja","P035"]
[" ","Obveze za nabavu nefinancijske imovine","P036"]
[" ","Obveze za vrijednosne papire","P037"]
[null,"Obveze za kredite i zajmove","P038"]

{"sheet":"OBVEZE","index":7,"n_rows":105,"n_cols":5,"rows_kept":105,"cut":false,"hidden":false,"merged":[[1,0,1,3]]}
["Obveznik:",null,"Razina:",null,"Razdoblje:"]
["IZVJEŠTAJ O OBVEZAMA"]
["Račun iz rač. plana","Opis stavke","Šifra","Iznos"]
[1,2,"3",4]
[null,"Stanje obveza 1. siječnja (=stanju obveza iz Izvještaja o obvezama na 31. prosinca prethodne godine)","V001",4503.8100000000004]
[null,"Povećanje obveza u izvještajnom razdoblju (šifre V003+N23+N24 + 'N dio 25,26')","V002",{"$f":"D7+D8+D17+D18","v":105230.97}]
[null,"Međusobne obveze subjekata općeg proračuna","V003",0]
["23","Obveze za rashode poslovanja (šifre N231 do N239)","N23",{"$f":"SUM(D9:D16)","v":85905.13}]
["231","Obveze za zaposlene","N231",58213.3]
["232","Obveze za materijalne rashode","N232",27691.83]
["234","Obveze za financijske rashode","N234"]
["235","Obveze za subvencije","N235"]
["236","Obveze za povrat pomoći unutar općeg proračuna po protestiranim jamstvima","N236"]
["237","Obveze za naknade građanima i kućanstvima","N237"]
["238","Obveze za kazne, naknade šteta i kapitalne pomoći","N238"]
["239","Ostale tekuće obveze","N239"]
["24","Obveze za nabavu nefinancijske imovine","N24",19325.84]
["dio 25,26","Obveze za financijsku imovinu (šifre 'N251, 253' + N254 + N256 + 'N262,263,2643,2644,2645,2653,2654,267' + 'N261,2646,2647,2648,2655,2656')","N dio 25,26",{"$f":"SUM(D19:D23)","v":0}]
[251.25299999999999,"Obveze za čekove i mjenice","N251, 253",0]
["254","Obveze za obveznice","N254"]
["256","Obveze za ostale vrijednosne papire","N256"]
["262,263,2643,2644,\n2645,2653,2654,267","Obveze za tuzemne kredite i zajmove","N262,263,2643,2644,2645,2653,2654,267"]
["261,2646,2647, 2648,2655,2656","Obveze za inozemne kredite i zajmove","N261,2646,2647,2648,2655,2656",0]
[null,"Podmirene obveze u izvještajnom razdoblju (šifre V005+P23+P24 + 'P dio 25,26')","V004",{"$f":"D25+D26+D35+D36","v":104172.9}]
[null,"Međusobne obveze subjekata općeg proračuna","V005",0]
["23","Obveze za rashode poslovanja (šifre P231 do P239)","P23",{"$f":"SUM(D27:D34)","v":85265.05}]
["231","Obveze za zaposlene","P231",57586.65]
["232","Obveze za materijalne rashode","P232",27678.400000000001]
["234","Obveze za financijske rashode","P234"]
["235","Obveze za subvencije","P235"]
["236","Obveze za povrat pomoći unutar općeg proračuna po protestiranim jamstvima","P236"]
["237","Obveze za naknade građanima i kućanstvima","P237"]
["238","Obveze za kazne, naknade šteta i kapitalne pomoći","P238"]
["239","Ostale tekuće obveze","P239"]
["24","Obveze za nabavu nefinancijske imovine","P24",18907.849999999999]
["dio 25,26","Obveze za financijsku imovinu (šifre 'P251,253' + P254 + P256 + 'P262,263,2643,2644, 2645,2653,2654,267' + 'P261,2646,2647, 2648,2655,2656')","P dio 25, 26",{"$f":"SUM(D37:D41)","v":0}]
[251.25299999999999,"Obveze za čekove i mjenice","P251, 253",0]
["254","Obveze za obveznice","P254"]
["256","Obveze za ostale vrijednosne papire","P256"]
["262,263,2643,2644, 2645,2653,2654,267","Obveze za tuzemne kredite i zajmove","P262,263,2643,2644, 2645,2653,2654,267"]
["261,2646,2647, 2648,2655,2656","Obveze za inozemne kredite i zajmove","P261,2646,2647, 2648,2655,2656"]
[null,"Stanje obveza na kraju izvještajnog razdoblja (šifre V001+V002-V004) i (šifre V007+V009)","V006",{"$f":"D5+D6-D24","v":5561.8800000000047}]
[null,"Stanje dospjelih obveza na kraju izvještajnog razdoblja (šifre V008+D23+D24 + 'D dio 25,26')","V007",{"$f":"D44+D49+D90+D95","v":0}]
[null,"Međusobne obveze subjekata općeg proračuna (šifre M001 do M004)","V008",{"$f":"SUM(D45:D48)","v":0}]
[null,"a) Prekoračenje 1 do 60 dana","M001",0]
[null,"b) Prekoračenje 61 do 180 dana","M002",0]
[null,"c) Prekoračenje 181 do 360 dana","M003",0]
[null,"d) Prekoračenje preko 360 dana","M004",0]
["23","Ukupno obveze za rashode poslovanja (šifre D231+D232+D234+D235+D236+D237+D 238+D239)","D23",{"$f":"D50+D55+D60+D65+D70+D75+D80+D85","v":0}]
["231","Obveze za zaposlene (šifre D231A do D231D)","D231",{"$f":"SUM(D51:D54)","v":0}]
[null,"a) Prekoračenje 1 do 60 dana","D231A",0]
[null,"b) Prekoračenje 61 do 180 dana","D231B"]
[null,"c) Prekoračenje 181 do 360 dana","D231C",0]
[null,"d) Prekoračenje preko 360 dana","D231D"]
["232","Obveze za materijalne rashode (šifre D232A do D232D)","D232",{"$f":"SUM(D56:D59)","v":0}]
[null,"a) Prekoračenje 1 do 60 dana","D232A",0]
[null,"b) Prekoračenje 61 do 180 dana","D232B",0]
[null,"c) Prekoračenje 181 do 360 dana","D232C",0]
[null,"d) Prekoračenje preko 360 dana","D232D"]
["234","Obveze za financijske rashode (šifre D234A do D234D)","D234",{"$f":"SUM(D61:D64)","v":0}]
[null,"a) Prekoračenje 1 do 60 dana","D234A"]
[null,"b) Prekoračenje 61 do 180 dana","D234B"]
[null,"c) Prekoračenje 181 do 360 dana","D234C"]
[null,"d) Prekoračenje preko 360 dana","D234D"]
["235","Obveze za subvencije (šifre D235A do D235D)","D235",{"$f":"SUM(D66:D69)","v":0}]
[null,"a) Prekoračenje 1 do 60 dana","D235A"]
[null,"b) Prekoračenje 61 do 180 dana","D235B"]
[null,"c) Prekoračenje 181 do 360 dana","D235C"]
[null,"d) Prekoračenje preko 360 dana","D235D"]
["236","Obveze za povrat pomoći unutar općeg proračuna po protestiranim jamstvima (šifre D236A do D236D)","D236",{"$f":"SUM(D71:D74)","v":0}]
[null,"a) Prekoračenje 1 do 60 dana","D236A"]
[null,"b) Prekoračenje 61 do 180 dana","D236B"]
[null,"c) Prekoračenje 181 do 360 dana","D236C"]
[null,"d) Prekoračenje preko 360 dana","D236D"]
["237","Obveze za naknade građanima i kućanstvima (šifre D237A do D237D)","D237",{"$f":"SUM(D76:D79)","v":0}]
[null,"a) Prekoračenje 1 do 60 dana","D237A"]
[null,"b) Prekoračenje 61 do 180 dana","D237B"]
[null,"c) Prekoračenje 181 do 360 dana","D237C"]
[null,"d) Prekoračenje preko 360 dana","D237D"]
["238","Obveze za kazne, naknade šteta i kapitalne pomoći (šifre D238A do D238D)","D 238",{"$f":"SUM(D81:D84)","v":0}]
[null,"a) Prekoračenje 1 do 60 dana","D238A"]
[null,"b) Prekoračenje 61 do 180 dana","D238B"]
[null,"c) Prekoračenje 181 do 360 dana","D238C"]
[null,"d) Prekoračenje preko 360 dana","D238D"]
["239","Ostale tekuće obveze (šifre D239A do D239D)","D239",{"$f":"SUM(D86:D89)","v":0}]
[null,"a) Prekoračenje 1 do 60 dana","D239A"]
[null,"b) Prekoračenje 61 do 180 dana","D239B"]
[null,"c) Prekoračenje 181 do 360 dana","D239C"]
[null,"d) Prekoračenje preko 360 dana","D239D"]
["24","Obveze za nabavu nefinancijske imovine (šifre D24A do D24D)","D24",{"$f":"SUM(D91:D94)","v":0}]
[null,"a) Prekoračenje 1 do 60 dana","D24A",0]
[null,"b) Prekoračenje 61 do 180 dana","D24B",0]
[null,"c) Prekoračenje 181 do 360 dana","D24C",0]
[null,"d) Prekoračenje preko 360 dana","D24D"]
["dio 25,26","Obveze za financijsku imovinu (šifre 'D 251,253' + D254 + D256 + 'D262,263,2643,2644, 2645,2653,2654,267' + 'D261,2646,2647, 2648,2655,2656')","D dio 25,26",{"$f":"SUM(D96:D100)","v":0}]
[251.25299999999999,"Obveze za čekove i mjenice","D 251,253"]
["254","Obveze za obveznice","D254"]
["256","Obveze za ostale vrijednosne papire","D256"]
["262,263,2643,2644, 2645,2653,2654,267","Obveze za tuzemne kredite i zajmove","D262,263,2643,2644, 2645,2653,2654,267"]
["261,2646,2647, 2648,2655,2656","Obveze za inozemne kredite i zajmove","D261,2646,2647, 2648,2655,2656"]
[null,"Stanje nedospjelih obveza na kraju izvještajnog razdoblja (šifre V010 + ND23 + ND24 + 'ND dio 25,26')","V009",{"$f":"SUM(D102:D105)","v":5561.88}]
[null,"Međusobne obveze subjekata općeg proračuna","V010"]
["23","Obveze za rashode poslovanja","ND23",5143.8900000000003]
["24","Obveze za nabavu nefinancijske imovine","ND24",417.99]
["dio 25,26","Obveze za financijsku imovinu","ND dio 25,26"]

{"sheet":"Kont","index":8,"n_rows":1450,"n_cols":15,"rows_kept":1450,"cut":false,"hidden":false,"merged":[[315,0,315,2],[276,0,276,2],[310,0,310,2],[313,0,313,2],[0,0,0,3],[1,0,1,3],[3,0,3,2],[13,0,13,2],[19,0,19,2]]}
["IZVJEŠTAJ O OBVEZAMA",null,null,null,"REZ"]
["KONTROLE"]
["Rbr.","Rezultat kontrole","Opis kontrole",null,{"$f":"E4+E14+E20+E277+E311+E314+E316","v":0},{"$f":"F4+F14+F20+F277+F311+F314+F316","v":2},{"$f":"IF(RefStr!C12<>\"\",INT(VALUE(MID(RefStr!C12,1,4))),0)","v":2023},{"$f":"IF(RefStr!C12<>\"\",INT(VALUE(MID(RefStr!C12,6,2))),0)","v":12},{"$f":"RefStr!C10*1","v":21},{"$f":"RefStr!H7","v":"DA"},{"$f":"RefStr!H9","v":"DA"},{"$f":"RefStr!H10","v":"DA"},{"$f":"RefStr!H8","v":"DA"},{"$f":"RefStr!H11","v":"DA"},{"$f":"RefStr!C6","v":42635}]
["OPĆE KONTROLE - Kontrole podataka iz zaglavlja i kontrole popunjenosti obrazaca",null,null,null,{"$f":"SUM(E5:E13)","v":0},0,null,null,"3 i 9 mjesec","6. mjesec","12. mjeseci"]
[1,{"$f":"IF(E5=1,\"Pogreška\",IF(F5=1,\"Provjera\",\"O.K.\"))","v":"O.K."},"Razina 11 (od 2016. godine)\n- za kvartale te za polugodište (I.-III., I.-VI., I.-IX.) predaje obrasce PR-RAS i Obveze\n- za kraj godine predaje SVE obrasce: PR-RAS, BIL, P-VRIO, RAS-funkcijski i Obveze.\nOva kontrola javlja pogrešku ako je popunjen obrazac koji se za upisano razdoblje i razinu ne treba popuniti, ili ako nije popunjen neki koji se treba popuniti.",null,{"$f":"MAX(G5:K5)","v":0},0,null,null,{"$f":"IF(AND($I$3=11,OR($H$3=3,$H$3=9),OR($J$3<>\"DA\",$K$3<>\"NE\",$L$3<>\"NE\",$M$3<>\"NE\",$N$3<>\"DA\")),1,0)","v":0},{"$f":"IF(AND($I$3=11,$H$3=6,OR($J$3<>\"DA\",$K$3<>\"NE\",$L$3<>\"NE\",$M$3<>\"NE\",$N$3<>\"DA\")),1,0)","v":0},{"$f":"IF(AND($I$3=11,$H$3=12,OR($J$3<>\"DA\",$K$3<>\"DA\",$L$3<>\"DA\",$M$3<>\"DA\",$N$3<>\"DA\")),1,0)","v":0}]
[2,"O.K.","Razina 12 (od 2016. godine)\n- za kvartale (I.-III., I.-IX.) predaje samo obrazac Obveze,\n- za polugodište predaje obrazac PR-RAS te obrazac Obveze\n- za kraj godine predaje SVE obrasce: PR-RAS, BIL, P-VRIO, RAS-funkcijski i Obveze.\nOva kontrola javlja pogrešku ako je popunjen obrazac koji se za upisano razdoblje i razinu ne treba popuniti, ili ako nije popunjen neki koji se treba popuniti.",null,0,0,null,null,{"$f":"IF(AND($I$3=12,OR($H$3=3,$H$3=9),OR($J$3<>\"NE\",$K$3<>\"NE\",$L$3<>\"NE\",$M$3<>\"NE\",$N$3<>\"DA\")),1,0)","v":0},{"$f":"IF(AND($I$3=12,$H$3=6,OR($J$3<>\"DA\",$K$3<>\"NE\",$L$3<>\"NE\",$M$3<>\"NE\",$N$3<>\"DA\")),1,0)","v":0},{"$f":"IF(AND($I$3=12,$H$3=12,OR(J3<>\"DA\",K3<>\"DA\",L3<>\"DA\",M3<>\"DA\",N3<>\"DA\")),1,0)","v":0}]
[3,"O.K.","Razina 13, opća država (od 2016. godine)\n- za kvartale te za polugodište (I.-III., I.-VI., I.-IX.) predaje samo obrazac PR-RAS\n- za kraj godine predaje obrasce: PR-RAS, BIL, P-VRIO i RAS-funkcijski.\nOva kontrola javlja pogrešku ako je popunjen obrazac koji se za upisano razdoblje i razinu ne treba popuniti, ili ako nije popunjen neki koji se treba popuniti.",null,0,0,null,null,{"$f":"IF(AND($I$3=13,OR($H$3=3,$H$3=9),OR($J$3<>\"DA\",$K$3<>\"NE\",$L$3<>\"NE\",$M$3<>\"NE\",$N$3<>\"NE\")),1,0)","v":0},{"$f":"IF(AND($I$3=13,$H$3=6,OR($J$3<>\"DA\",$K$3<>\"NE\",$L$3<>\"NE\",$M$3<>\"NE\",$N$3<>\"NE\")),1,0)","v":0},{"$f":"IF(AND($I$3=13,$H$3=12,OR($J$3<>\"DA\",$K$3<>\"DA\",$L$3<>\"DA\",$M$3<>\"DA\",$N$3<>\"NE\")),1,0)","v":0}]
[4,"O.K.","Razina 21 (od 2016. godine)\n- za kvartale (I.-III., I.-IX.) predaje samo obrazac PR-RAS\n- za polugodište predaje obrasce PR-RAS i Obveze,\n- na godišnjoj razini predaje sve obrasce: PR-RAS, BIL, RAS-funkcijski, P-VRIO i Obveze.\nOva kontrola javlja pogrešku ako je popunjen obrazac koji se za upisano razdoblje i razinu ne treba popuniti, ili ako nije popunjen neki koji se treba popuniti.",null,0,0,null,null,{"$f":"IF(AND($I$3=21,OR($H$3=3,$H$3=9),OR($J$3<>\"DA\",$K$3<>\"NE\",$L$3<>\"NE\",$M$3<>\"NE\",$N$3<>\"NE\")),1,0)","v":0},{"$f":"IF(AND($I$3=21,$H$3=6,OR($J$3<>\"DA\",$K$3<>\"NE\",$L$3<>\"NE\",$M$3<>\"NE\",$N$3<>\"DA\")),1,0)","v":0},{"$f":"IF(AND($I$3=21,$H$3=12,OR($J$3<>\"DA\",$K$3<>\"DA\",$L$3<>\"DA\",$M$3<>\"DA\",$N$3<>\"DA\")),1,0)","v":0}]
[5,"O.K.","Razina 22 (od 2016. godine)\n- za kvartale te za polugodište (I.-III., I.-VI., I.-IX.) predaje obrasce PR-RAS i Obveze\n- za kraj godine predaje SVE obrasce: PR-RAS, BIL, P-VRIO, RAS-funkcijski i Obveze.\nOva kontrola javlja pogrešku ako je popunjen obrazac koji se za upisano razdoblje i razinu ne treba popuniti, ili ako nije popunjen neki koji se treba popuniti.",null,0,0,null,null,{"$f":"IF(AND($I$3=22,OR($H$3=3,$H$3=9),OR($J$3<>\"DA\",$K$3<>\"NE\",$L$3<>\"NE\",$M$3<>\"NE\",$N$3<>\"DA\")),1,0)","v":0},{"$f":"IF(AND($I$3=22,$H$3=6,OR($J$3<>\"DA\",$K$3<>\"NE\",$L$3<>\"NE\",$M$3<>\"NE\",$N$3<>\"DA\")),1,0)","v":0},{"$f":"IF(AND($I$3=22,$H$3=12,OR($J$3<>\"DA\",$K$3<>\"DA\",$L$3<>\"DA\",$M$3<>\"DA\",$N$3<>\"DA\")),1,0)","v":0}]
[6,"O.K.","Razina 23 (od 2016. godine)\n- za kvartale ne predaje ništa, nema konsolidacije,\n- za polugodište (I.-VI.) predaje obrasce PR-RAS i Obveze\n- za kraj godine predaje SVE obrasce: PR-RAS, BIL, P-VRIO, RAS-funkcijski i Obveze.\nOva kontrola javlja pogrešku ako je popunjen obrazac koji se za upisano razdoblje i razinu ne treba popuniti, ili ako nije popunjen neki koji se treba popuniti.",null,0,0,null,null,{"$f":"IF(AND($I$3=23,OR($H$3=3,$H$3=9)),1,0)","v":0},{"$f":"IF(AND($I$3=23,$H$3=6,OR($J$3<>\"DA\",$K$3<>\"NE\",$L$3<>\"NE\",$M$3<>\"NE\",$N$3<>\"DA\")),1,0)","v":0},{"$f":"IF(AND($I$3=23,$H$3=12,OR($J$3<>\"DA\",$K$3<>\"DA\",$L$3<>\"DA\",$M$3<>\"DA\",$N$3<>\"DA\")),1,0)","v":0}]
[7,"O.K.","Razine 31 (od 2016. godine)\n- za kvartale (I.-III., I.-IX.) predaje samo obrazac PR-RAS\n- za polugodište predaje obrasce PR-RAS i Obveze\n- na godišnjoj razini predaje sve obrasce: PR-RAS, BIL, RAS-funkcijski, P-VRIO i Obveze. \nOva kontrola javlja pogrešku ako je popunjen obrazac koji se za upisano razdoblje i razinu ne treba popuniti, ili ako nije popunjen neki koji se treba popuniti.",null,0,0,null,null,{"$f":"IF(AND($I$3=31,OR($H$3=3,$H$3=9),OR($J$3<>\"DA\",$K$3<>\"NE\",$L$3<>\"NE\",$M$3<>\"NE\",$N$3<>\"NE\")),1,0)","v":0},{"$f":"IF(AND($I$3=31,$H$3=6,OR($J$3<>\"DA\",$K$3<>\"NE\",$L$3<>\"NE\",$M$3<>\"NE\",$N$3<>\"DA\")),1,0)","v":0},{"$f":"IF(AND($I$3=31,$H$3=12,OR($J$3<>\"DA\",$K$3<>\"DA\",$L$3<>\"DA\",$M$3<>\"DA\",$N$3<>\"DA\")),1,0)","v":0}]
[8,"O.K.","Razina 41 (od 2016. godine)\n- za kvartale i polugodište (I.-III., I.-VI. i I.-IX.) predaje obrasce PR-RAS i Obveze\n- na godišnjoj razini predaje sve obrasce: PR-RAS, BIL, RAS-funkcijski, P-VRIO i Obveze. \nOva kontrola javlja pogrešku ako je popunjen obrazac koji se za upisano razdoblje i razinu ne treba popuniti, ili ako nije popunjen neki koji se treba popuniti.",null,0,0,null,null,{"$f":"IF(AND($I$3=41,OR($H$3=3,$H$3=9),OR($J$3<>\"DA\",$K$3<>\"NE\",$L$3<>\"NE\",$M$3<>\"NE\",$N$3<>\"DA\")),1,0)","v":0},{"$f":"IF(AND($I$3=41,$H$3=6,OR($J$3<>\"DA\",$K$3<>\"NE\",$L$3<>\"NE\",$M$3<>\"NE\",$N$3<>\"DA\")),1,0)","v":0},{"$f":"IF(AND($I$3=41,$H$3=12,OR($J$3<>\"DA\",$K$3<>\"DA\",$L$3<>\"DA\",$M$3<>\"DA\",$N$3<>\"DA\")),1,0)","v":0}]
[9,"O.K.","Razine 42 (od 2016. godine)\n- za kvartale (I.-III., I.-IX.) predaje samo obrazac PR-RAS\n- za polugodište predaje obrasce PR-RAS i Obveze\n- na godišnjoj razini predaje sve obrasce: PR-RAS, BIL, RAS-funkcijski, P-VRIO i Obveze. \nOva kontrola javlja pogrešku ako je popunjen obrazac koji se za upisano razdoblje i razinu ne treba popuniti, ili ako nije popunjen neki koji se treba popuniti.",null,0,0,null,null,{"$f":"IF(AND($I$3=42,OR($H$3=3,$H$3=9),OR($J$3<>\"DA\",$K$3<>\"NE\",$L$3<>\"NE\",$M$3<>\"NE\",$N$3<>\"NE\")),1,0)","v":0},{"$f":"IF(AND($I$3=42,$H$3=6,OR($J$3<>\"DA\",$K$3<>\"NE\",$L$3<>\"NE\",$M$3<>\"NE\",$N$3<>\"DA\")),1,0)","v":0},{"$f":"IF(AND($I$3=42,$H$3=12,OR($J$3<>\"DA\",$K$3<>\"DA\",$L$3<>\"DA\",$M$3<>\"DA\",$N$3<>\"DA\")),1,0)","v":0}]
["Kontrole između dva različita obrasca",null,null,null,{"$f":"SUM(E15:E19)","v":0},{"$f":"SUM(F15:F19)","v":0}]
[1,{"$f":"IF(E15=1,\"Pogreška\",IF(F15=1,\"Provjera\",\"O.K.\"))","v":"O.K."},"Na godišnjoj razini, šifra 19 u obrascu Bilanca mora biti jednaka šifri 19 u obrascu PR-RAS. Ova kontrola je obvezujuća za razine 11, 21, 22, 31, 41, 42, a upozoravajuća za razine 12, 13 i 23. Ova kontrola vrijedi u obje kolone podataka, osim za obveznike kod kojih početak razdoblja nije ujedno i početak poslovne godine (obveznik je počeo s radom tokom godine). Za takve obveznike kontrola vrijedi samo za kolonu tekuće godine (ne i prethodne).",null,{"$f":"MAX(G15:K15)","v":0},{"$f":"MAX(L15:O15)","v":0},{"$f":"IF(AND(H3=12,J3=\"DA\",M3=\"DA\",OR(I3=11,I3=21,I3=22,I3=31,I3=41,I3=42),ABS(BILANCA!D170-'PR-RAS'!D647)>0.001),1,0)","v":0},{"$f":"IF(AND(H3=12,J3=\"DA\",M3=\"DA\",OR(I3=11,I3=21,I3=22,I3=31,I3=41,I3=42),ABS(BILANCA!E170-'PR-RAS'!E647)>0.001),1,0)","v":0},null,null,null,{"$f":"IF(AND(H3=12,J3=\"DA\",M3=\"DA\",OR(I3=12,I3=13,I3=23),ABS(BILANCA!D170-'PR-RAS'!D647)>0.001),1,0)","v":0},{"$f":"IF(AND(H3=12,J3=\"DA\",M3=\"DA\",OR(I3=12,I3=13,I3=23),ABS(BILANCA!E170-'PR-RAS'!E647)>0.001),1,0)","v":0}]
[2,"O.K.","Na godišnjoj razini, šifra 11 u obrascu Bilanca mora biti jednaka šifri 11K u obrascu PR-RAS. Ova kontrola je obvezujuća za razine 11, 21, 22, 31, 41 i 42, a upozoravajuća za razine 12, 13, 23. Ova kontrola vrijedi u obje kolone podataka.",null,0,{"$f":"MAX(L16:O16)","v":0},{"$f":"IF(AND(H3=12,J3=\"DA\",M3=\"DA\",OR(I3=11,I3=21,I3=22,I3=31,I3=41,I3=42),ABS(BILANCA!D69-'PR-RAS'!D652)>0.001),1,0)","v":0},{"$f":"IF(AND(H3=12,J3=\"DA\",M3=\"DA\",OR(I3=11,I3=21,I3=22,I3=31,I3=41,I3=42),ABS(BILANCA!E69-'PR-RAS'!E652)>0.001),1,0)","v":0},null,null,null,{"$f":"IF(AND(H3=12,J3=\"DA\",M3=\"DA\",OR(I3=12,I3=13,I3=23),ABS(BILANCA!D69-'PR-RAS'!D652)>0.001),1,0)","v":0},{"$f":"IF(AND(H3=12,J3=\"DA\",M3=\"DA\",OR(I3=12,I3=13,I3=23),ABS(BILANCA!E69-'PR-RAS'!E652)>0.001),1,0)","v":0}]
[3,"O.K.","Na godišnjoj razini, ako je u Bilanci šifra 9221 > 9222, tada šifra X006 u PR-RAS-u mora biti jednaka šifri 9221-9222 u Bilanci, a šifra Y006 mora biti nula. Ako je u Bilanci šifra 9222 > 9221 tada šifra Y006 u PR-RAS-u mora biti jednaka šifri 9222 - 9221 u Bilanci, a šifra X006 u PR-RAS-u mora biti nula. Ova kontrola vrijedi za obje godine osim u slučaju kada je u PR-RAS obrascu kolona prethodne godine nepopunjena.",null,{"$f":"MAX(G17:L17)","v":0},0,{"$f":"IF(AND(H3=12,J3=\"DA\",M3=\"DA\",BILANCA!D246>=BILANCA!D250,OR(ABS(BILANCA!D246-BILANCA!D250-'PR-RAS'!D645)>0.001,'PR-RAS'!D646<>0)),1,0)","v":0},{"$f":"IF(AND(H3=12,J3=\"DA\",M3=\"DA\",BILANCA!E246>=BILANCA!E250,OR(ABS(BILANCA!E246-BILANCA!E250-'PR-RAS'!E645)>0.001,'PR-RAS'!E646<>0)),1,0)","v":0},{"$f":"IF(AND(H3=12,J3=\"DA\",M3=\"DA\",BILANCA!D250>=BILANCA!D246,OR(ABS(BILANCA!D250-BILANCA!D246-'PR-RAS'!D646)>0.001,'PR-RAS'!D645<>0)),1,0)","v":0},{"$f":"IF(AND(H3=12,J3=\"DA\",M3=\"DA\",BILANCA!E250>=BILANCA!E246,OR(ABS(BILANCA!E250-BILANCA!E246-'PR-RAS'!E646)>0.001,'PR-RAS'!E645<>0)),1,0)","v":0}]
[4,"O.K.","Ako je obrazac RAS-funkcijski popunjen, tada razlika šifri Y034 i 367 (šifre Y034-367) u obrascu PR-RAS treba biti jednaka zbroju svih rashoda po vrstama, tj. šifri R1 u obrascu RAS-funkcijski.",null,0,0,{"$f":"IF(AND(J3=\"DA\",K3=\"DA\",I3<>12,I3<>23,ABS('PR-RAS'!D413-'PR-RAS'!D240-'RAS-funkcijski'!D141)>0.001),1,0)","v":0},{"$f":"IF(AND(J3=\"DA\",K3=\"DA\",I3<>12,I3<>23,ABS('PR-RAS'!E413-'PR-RAS'!E240-'RAS-funkcijski'!E141)>0.001),1,0)","v":0}]
[5,{"$f":"IF(E19=1,\"Pogreška\",IF(F19=1,\"Provjera\",\"O.K.\"))","v":"O.K."},"Na godišnjoj razini, šifra V006 u obrascu Obveze mora biti jednaka razlici šifri 2 i 29 (šifre 2-29) u obrascu Bilanca.",null,{"$f":"MAX(H19:L19)","v":0},0,null,{"$f":"IF(AND(H3=12,ABS(BILANCA!E176-BILANCA!E234-OBVEZE!D42)>0.001),1,0)","v":0}]
["Kontrole na obrascu PR-RAS",null,null,null,{"$f":"SUM(E21:E276)","v":0},{"$f":"SUM(F21:F276)","v":2}]
[1,{"$f":"IF(E21=1,\"Pogreška\",IF(F21=1,\"Provjera\",\"O.K.\"))","v":"O.K."},"Ako je u nekom stupcu na šiframa Z006 do Z009 (broj zaposlenih) podatak veći od nule, tada mora postojati podatak na šifri 31 (rashodi za zaposlene) veći od nule. Ako su na šifri 31 iskazani rashodi za zaposlene mora postojati i podatak o broju zaposlenih.",null,{"$f":"MAX(G21:K21)","v":0},{"$f":"MAX(L21:O21)","v":0},{"$f":"IF(OR(AND('PR-RAS'!D152=0,MAX('PR-RAS'!D653:D656)>0),AND('PR-RAS'!E152=0,MAX('PR-RAS'!E653:E656)>0)),1,0)","v":0},{"$f":"IF(OR(AND('PR-RAS'!D152<>0,MAX('PR-RAS'!D653:D656)=0),AND('PR-RAS'!E152<>0,MAX('PR-RAS'!E653:E656)=0)),1,0)","v":0}]
[2,{"$f":"IF(E22=1,\"Pogreška\",IF(F22=1,\"Provjera\",\"O.K.\"))","v":"O.K."},"Ako je u nekom stupcu na šifri Z006 broj veći od nule, tada i na šifri Z008 mora biti broj veći od nule i obrnuto.",null,0,{"$f":"MAX(L22:O22)","v":0},{"$f":"IF(OR(AND('PR-RAS'!D653=0,'PR-RAS'!D655<>0),AND('PR-RAS'!D653<>0,'PR-RAS'!D655=0)),1,0)","v":0},{"$f":"IF(OR(AND('PR-RAS'!E653=0,'PR-RAS'!E655<>0),AND('PR-RAS'!E653<>0,'PR-RAS'!E655=0)),1,0)","v":0}]
[3,"O.K.","Ako je u nekom stupcu na šifri Z007 broj veći od nule, tada i na šifri Z009 mora biti broj veći od nule i obrnuto.",null,0,0,{"$f":"IF(OR(AND('PR-RAS'!D654=0,'PR-RAS'!D656<>0),AND('PR-RAS'!D654<>0,'PR-RAS'!D656=0)),1,0)","v":0},{"$f":"IF(OR(AND('PR-RAS'!E654=0,'PR-RAS'!E656<>0),AND('PR-RAS'!E654<>0,'PR-RAS'!E656=0)),1,0)","v":0}]
[4,"O.K.","Šifra 61315 je samo dio šifre 6131 i mora joj biti manja ili jednaka u oba stupca podataka.",null,0,0,{"$f":"IF(ROUND('PR-RAS'!D658,2)>ROUND('PR-RAS'!D24,2),1,0)","v":0},{"$f":"IF(ROUND('PR-RAS'!E658,2)>ROUND('PR-RAS'!E24,2),1,0)","v":0}]
[5,"O.K.","Zbroj šifri: 61451+61453 je samo dio šifre 6145 i mora joj biti manji ili jednak u oba stupca podataka.",null,0,0,{"$f":"IF(ROUND('PR-RAS'!D659+'PR-RAS'!D660,2)>ROUND('PR-RAS'!D33,2),1,0)","v":0},{"$f":"IF(ROUND('PR-RAS'!E659+'PR-RAS'!E660,2)>ROUND('PR-RAS'!E33,2),1,0)","v":0}]
[6,"O.K.","Šifra 6331 mora biti jednaka zbroju šifri: 63311 do 63314 u oba stupca podataka.",null,0,0,{"$f":"IF(ABS('PR-RAS'!D60-SUM('PR-RAS'!D661:D664))>0.001,1,0)","v":0},{"$f":"IF(ABS('PR-RAS'!E60-SUM('PR-RAS'!E661:E664))>0.001,1,0)","v":0}]
[7,"O.K.","Šifra 6332 mora biti jednaka zbroju šifri: 63321 do 63324 u oba stupca podataka.",null,0,0,{"$f":"IF(ABS('PR-RAS'!D61-SUM('PR-RAS'!D665:'PR-RAS'!D668))>0.001,1,0)","v":0},{"$f":"IF(ABS('PR-RAS'!E61-SUM('PR-RAS'!E665:'PR-RAS'!E668))>0.001,1,0)","v":0}]
[8,"O.K.","Šifra 6341 mora biti jednaka zbroju šifri: 63414 do 63416 u oba stupca podataka.",null,0,0,{"$f":"IF(ABS('PR-RAS'!D63-SUM('PR-RAS'!D669:D671))>0.001,1,0)","v":0},{"$f":"IF(ABS('PR-RAS'!E63-SUM('PR-RAS'!E669:E671))>0.001,1,0)","v":0}]
[9,"O.K.","Šifra 6342 mora biti jednaka zbroju šifri: 63424 do 63426 u oba stupca podataka.",null,0,0,{"$f":"IF(ABS('PR-RAS'!D64-SUM('PR-RAS'!D672:D674))>0.001,1,0)","v":0},{"$f":"IF(ABS('PR-RAS'!E64-SUM('PR-RAS'!E672:E674))>0.001,1,0)","v":0}]
[10,"O.K.","Šifra 6361 mora biti jednaka zbroju šifri: 63612 i 63613 u oba stupca podataka.",null,0,0,{"$f":"IF(ROUND('PR-RAS'!D69,2)<>ROUND('PR-RAS'!D675+'PR-RAS'!D676,2),1,0)","v":0},{"$f":"IF(ROUND('PR-RAS'!E69,2)<>ROUND('PR-RAS'!E675+'PR-RAS'!E676,2),1,0)","v":0}]
[11,"O.K.","Šifra 6362 mora biti jednaka zbroju šifri: 63622 i 63623 u oba stupca podataka.",null,0,0,{"$f":"IF(ABS('PR-RAS'!D70-'PR-RAS'!D677-'PR-RAS'!D678)>0.001,1,0)","v":0},{"$f":"IF(ABS('PR-RAS'!E70-'PR-RAS'!E677-'PR-RAS'!E678)>0.001,1,0)","v":0}]
[238,"O.K.","Šifra 6371 mora biti jednaka zbroju šifri: 63711 do 63717 u oba stupca podataka.",null,0,0,{"$f":"IF(ABS('PR-RAS'!D72-SUM('PR-RAS'!D679:'PR-RAS'!D685))>0.001,1,0)","v":0},{"$f":"IF(ABS('PR-RAS'!E72-SUM('PR-RAS'!E679:'PR-RAS'!E685))>0.001,1,0)","v":0}]
[239,"O.K.","Šifra 6372 mora biti jednaka zbroju šifri 63721 do 63728 u oba stupca podataka.",null,0,0,{"$f":"IF(ABS('PR-RAS'!D73-SUM('PR-RAS'!D686:'PR-RAS'!D693))>0.001,1,0)","v":0},{"$f":"IF(ABS('PR-RAS'!E73-SUM('PR-RAS'!E686:'PR-RAS'!E693))>0.001,1,0)","v":0}]
[12,{"$f":"IF(E34=1,\"Pogreška\",IF(F34=1,\"Provjera\",\"O.K.\"))","v":"O.K."},"Šifra 6381 mora biti jednaka zbroju šifri: 63811 do 63814 u oba stupca podataka.",null,0,0,{"$f":"IF(ABS('PR-RAS'!D75-SUM('PR-RAS'!D694:D697))>0.001,1,0)","v":0},{"$f":"IF(ABS('PR-RAS'!E75-SUM('PR-RAS'!E694:E697))>0.001,1,0)","v":0}]
[13,"O.K.","Šifra 6382 mora biti jednaka zbroju šifri: 63821 do 63824 u oba stupca podataka.",null,0,0,{"$f":"IF(ABS('PR-RAS'!D76-SUM('PR-RAS'!D698:D701))>0.001,1,0)","v":0},{"$f":"IF(ABS('PR-RAS'!E76-SUM('PR-RAS'!E698:E701))>0.001,1,0)","v":0}]
[14,"O.K.","Šifra 64191 je samo dio šifre 6419 i mora joj biti manja ili jednaka u oba stupca podataka.",null,0,0,{"$f":"IF(ROUND('PR-RAS'!D702,2)>ROUND('PR-RAS'!D90,2),1,0)","v":0},{"$f":"IF(ROUND('PR-RAS'!E702,2)>ROUND('PR-RAS'!E90,2),1,0)","v":0}]
[15,"O.K.","Šifra 6437 mora biti jednaka zbroju šifri: 64371 do 64377 u oba stupca podataka.",null,0,0,{"$f":"IF(ABS('PR-RAS'!D105-SUM('PR-RAS'!D703:D709))>0.001,1,0)","v":0},{"$f":"IF(ABS('PR-RAS'!E105-SUM('PR-RAS'!E703:E709))>0.001,1,0)","v":0}]
[16,"O.K.","Zbroj šifri 65264 do 65267 je samo dio šifre 6526 i mora joj biti manji ili jednak u oba stupca podataka.",null,0,0,{"$f":"IF(ROUND(SUM('PR-RAS'!D710:D712),2)>ROUND('PR-RAS'!D117,2),1,0)","v":0},{"$f":"IF(ROUND(SUM('PR-RAS'!E710:E712),2)>ROUND('PR-RAS'!E117,2),1,0)","v":0}]
[240,"O.K.","Šifra 6634 mora biti jednaka zbroju šifri: 66341 do 66343 u oba stupca podataka.",null,0,0,{"$f":"IF(ABS('PR-RAS'!D132-SUM('PR-RAS'!D713:D715))>0.001,1,0)","v":0},{"$f":"IF(ABS('PR-RAS'!E132-SUM('PR-RAS'!E713:E715))>0.001,1,0)","v":0}]
[17,{"$f":"IF(E40=1,\"Pogreška\",IF(F40=1,\"Provjera\",\"O.K.\"))","v":"O.K."},"Zbroj šifri 31214 i 31215 je samo dio šifre 312 i mora joj biti manji ili jednak u oba stupca podataka.",null,0,0,{"$f":"IF(ROUND('PR-RAS'!D716+'PR-RAS'!D717,2)>ROUND('PR-RAS'!D158,2),1,0)","v":0},{"$f":"IF(ROUND('PR-RAS'!E716+'PR-RAS'!E717,2)>ROUND('PR-RAS'!E158,2),1,0)","v":0}]
[18,"O.K.","Šifra 32121 je samo dio šifre 3212 i mora joj biti manja ili jednaka u oba stupca podataka.",null,0,0,{"$f":"IF(ROUND('PR-RAS'!D718,2)>ROUND('PR-RAS'!D166,2),1,0)","v":0},{"$f":"IF(ROUND('PR-RAS'!E718,2)>ROUND('PR-RAS'!E166,2),1,0)","v":0}]
[19,"O.K.","Šifra 32351 je samo dio šifre 3235 i mora joj biti manja ili jednaka u oba stupca podataka.",null,0,0,{"$f":"IF(ROUND('PR-RAS'!D719,2)>ROUND('PR-RAS'!D182,2),1,0)","v":0},{"$f":"IF(ROUND('PR-RAS'!E719,2)>ROUND('PR-RAS'!E182,2),1,0)","v":0}]
[20,"O.K.","Šifra 32361 je samo dio šifre 3236 i mora joj biti manja ili jednaka u oba stupca podataka.",null,0,0,{"$f":"IF(ROUND('PR-RAS'!D720,2)>ROUND('PR-RAS'!D183,2),1,0)","v":0},{"$f":"IF(ROUND('PR-RAS'!E720,2)>ROUND('PR-RAS'!E183,2),1,0)","v":0}]
[21,"O.K.","Zbroj šifri 32371 do 32377 je samo dio šifre 3237 i mora joj biti manji ili jednak u oba stupca podataka.",null,0,0,{"$f":"IF(ROUND(SUM('PR-RAS'!D721:D723),2)>ROUND('PR-RAS'!D184,2),1,0)","v":0},{"$f":"IF(ROUND(SUM('PR-RAS'!E721:E723),2)>ROUND('PR-RAS'!E184,2),1,0)","v":0}]
[22,"O.K.","Šifra 32398 je samo dio šifre 3239 i mora joj biti manja ili jednaka u oba stupca podataka.",null,0,0,{"$f":"IF(ROUND('PR-RAS'!D724,2)>ROUND('PR-RAS'!D186,2),1,0)","v":0},{"$f":"IF(ROUND('PR-RAS'!E724,2)>ROUND('PR-RAS'!E186,2),1,0)","v":0}]
[23,"O.K.","Šifra 32911 je samo dio šifre 3291 i mora joj biti manja ili jednaka u oba stupca podataka.",null,0,0,{"$f":"IF(ROUND('PR-RAS'!D725,2)>ROUND('PR-RAS'!D189,2),1,0)","v":0},{"$f":"IF(ROUND('PR-RAS'!E725,2)>ROUND('PR-RAS'!E189,2),1,0)","v":0}]
[24,"O.K.","Šifra 32923 je samo dio šifre 3292 i mora joj biti manja ili jednaka u oba stupca podataka.",null,0,0,{"$f":"IF(ROUND('PR-RAS'!D726,2)>ROUND('PR-RAS'!D190,2),1,0)","v":0},{"$f":"IF(ROUND('PR-RAS'!E726,2)>ROUND('PR-RAS'!E190,2),1,0)","v":0}]
[25,"O.K.","Šifra 3411 mora biti jednaka zbroju šifri: 34111+34112 u oba stupca podataka.",null,0,0,{"$f":"IF(ABS('PR-RAS'!D727+'PR-RAS'!D728-'PR-RAS'!D198)>0.001,1,0)","v":0},{"$f":"IF(ABS('PR-RAS'!E727+'PR-RAS'!E728-'PR-RAS'!E198)>0.001,1,0)","v":0}]
[26,"O.K.","Šifra 3412 mora biti jednaka zbroju šifri: 34121+34122 u oba stupca podataka.",null,0,0,{"$f":"IF(ABS('PR-RAS'!D729+'PR-RAS'!D730-'PR-RAS'!D199)>0.001,1,0)","v":0},{"$f":"IF(ABS('PR-RAS'!E729+'PR-RAS'!E730-'PR-RAS'!E199)>0.001,1,0)","v":0}]
[27,"O.K.","Šifra 3413 mora biti jednaka zbroju šifri: 34131+34132 u oba stupca podataka.",null,0,0,{"$f":"IF(ABS('PR-RAS'!D731+'PR-RAS'!D732-'PR-RAS'!D200)>0.001,1,0)","v":0},{"$f":"IF(ABS('PR-RAS'!E731+'PR-RAS'!E732-'PR-RAS'!E200)>0.001,1,0)","v":0}]
[28,"O.K.","Šifra 3419 mora biti jednaka zbroju šifri: 34191+34192 u oba stupca podataka.",null,0,0,{"$f":"IF(ABS('PR-RAS'!D733+'PR-RAS'!D734-'PR-RAS'!D201)>0.001,1,0)","v":0},{"$f":"IF(ABS('PR-RAS'!E733+'PR-RAS'!E734-'PR-RAS'!E201)>0.001,1,0)","v":0}]
[29,"O.K.","Šifra 3421 mora biti jednaka zbroju šifri: 34213 do 34216 u oba stupca podataka.",null,0,0,{"$f":"IF(ABS('PR-RAS'!D203-SUM('PR-RAS'!D735:D738))>0.001,1,0)","v":0},{"$f":"IF(ABS('PR-RAS'!E203-SUM('PR-RAS'!E735:E738))>0.001,1,0)","v":0}]
[30,"O.K.","Šifra 3422 mora biti jednaka zbroju šifri: 34222 do 34224 u oba stupca podataka.",null,0,0,{"$f":"IF(ABS('PR-RAS'!D204-SUM('PR-RAS'!D739:D741))>0.001,1,0)","v":0},{"$f":"IF(ABS('PR-RAS'!E204-SUM('PR-RAS'!E739:E741))>0.001,1,0)","v":0}]
[31,"O.K.","Šifra 3423 mora biti jednaka zbroju šifri: 34233 do 34238 u oba stupca podataka.",null,0,0,{"$f":"IF(ABS('PR-RAS'!D205-SUM('PR-RAS'!D742:D747))>0.001,1,0)","v":0},{"$f":"IF(ABS('PR-RAS'!E205-SUM('PR-RAS'!E742:E747))>0.001,1,0)","v":0}]
[32,"O.K.","Zbroj šifri 34273 do 34275 je samo dio šifre 3427 i mora joj biti manji ili jednak u oba stupca podataka.",null,0,0,{"$f":"IF(ROUND(SUM('PR-RAS'!D748:D750),2)>ROUND('PR-RAS'!D208,2),1,0)","v":0},{"$f":"IF(ROUND(SUM('PR-RAS'!E748:E750),2)>ROUND('PR-RAS'!E208,2),1,0)","v":0}]
[33,"O.K.","Šifra 3428 mora biti jednaka zbroju šifri: 34281 do 34287 u oba stupca podataka.",null,0,0,{"$f":"IF(ABS('PR-RAS'!D209-SUM('PR-RAS'!D751:D757))>0.001,1,0)","v":0},{"$f":"IF(ABS('PR-RAS'!E209-SUM('PR-RAS'!E751:E757))>0.001,1,0)","v":0}]
[34,"O.K.","Šifra 34341 je samo dio šifre 3434 i mora joj biti manja ili jednaka u oba stupca podataka.",null,0,0,{"$f":"IF(ROUND('PR-RAS'!D758,2)>ROUND('PR-RAS'!D214,2),1,0)","v":0},{"$f":"IF(ROUND('PR-RAS'!E758,2)>ROUND('PR-RAS'!E214,2),1,0)","v":0}]
[35,"O.K.","Šifra 3523 mora biti jednaka zbroju šifri: 35231+35232 u oba stupca podataka.",null,0,0,{"$f":"IF(ABS('PR-RAS'!D222-'PR-RAS'!D759-'PR-RAS'!D760)>0.001,1,0)","v":0},{"$f":"IF(ABS('PR-RAS'!E222-'PR-RAS'!E759-'PR-RAS'!E760)>0.001,1,0)","v":0}]
[36,"O.K.","Šifra 3631 mora biti jednaka zbroju šifri: 36313 do 36319 u oba stupca podataka.",null,0,0,{"$f":"IF(ABS('PR-RAS'!D232-SUM('PR-RAS'!D761:D767))>0.001,1,0)","v":0},{"$f":"IF(ABS('PR-RAS'!E232-SUM('PR-RAS'!E761:E767))>0.001,1,0)","v":0}]
[37,"O.K.","Šifra 3632 mora biti jednaka zbroju šifri: 36323 do 36329 u oba stupca podataka. ",null,0,0,{"$f":"IF(ABS('PR-RAS'!D233-SUM('PR-RAS'!D768:D774))>0.001,1,0)","v":0},{"$f":"IF(ABS('PR-RAS'!E233-SUM('PR-RAS'!E768:E774))>0.001,1,0)","v":0}]
[241,"O.K.","Šifra 3635 mora biti jednaka zbroju šifri: 36351 do 36356 u oba stupca podataka.",null,0,0,{"$f":"IF(ABS('PR-RAS'!D234-SUM('PR-RAS'!D775:D780))>0.001,1,0)","v":0},{"$f":"IF(ABS('PR-RAS'!E234-SUM('PR-RAS'!E775:E780))>0.001,1,0)","v":0}]
[242,"O.K.","Šifra 3636 mora biti jednaka zbroju šifri: 36361 do 36367 u oba stupca podataka.",null,0,0,{"$f":"IF(ABS('PR-RAS'!D235-SUM('PR-RAS'!D781:D787))>0.001,1,0)","v":0},{"$f":"IF(ABS('PR-RAS'!E235-SUM('PR-RAS'!E781:E787))>0.001,1,0)","v":0}]
[243,"O.K.","Šifra 3663 mora biti jednaka zbroju šifri: 36631+36632 u oba stupca podataka.",null,0,0,{"$f":"IF(ABS('PR-RAS'!D239-SUM('PR-RAS'!D788:D789))>0.001,1,0)","v":0},{"$f":"IF(ABS('PR-RAS'!E239-SUM('PR-RAS'!E788:E789))>0.001,1,0)","v":0}]
[38,"O.K.","Šifra 3681 mora biti jednaka zbroju šifri: 36811 do 36819 u oba stupca podataka.",null,0,0,{"$f":"IF(ABS('PR-RAS'!D245-SUM('PR-RAS'!D790:D798))>0.001,1,0)","v":0},{"$f":"IF(ABS('PR-RAS'!E245-SUM('PR-RAS'!E790:E798))>0.001,1,0)","v":0}]
[39,"O.K.","Šifra 3682 mora biti jednaka zbroju šifri: 36821 do 36829 u oba stupca podataka.",null,0,0,{"$f":"IF(ABS('PR-RAS'!D246-SUM('PR-RAS'!D799:D807))>0.001,1,0)","v":0},{"$f":"IF(ABS('PR-RAS'!E246-SUM('PR-RAS'!E799:E807))>0.001,1,0)","v":0}]
[40,"O.K.","Šifra 3713 mora biti jednaka zbroju šifri: 37131 do 37139 u oba stupca podataka.",null,0,0,{"$f":"IF(ABS('PR-RAS'!D256-SUM('PR-RAS'!D808:D810))>0.001,1,0)","v":0},{"$f":"IF(ABS('PR-RAS'!E256-SUM('PR-RAS'!E808:E810))>0.001,1,0)","v":0}]
[41,"O.K.","Šifra 3714 mora biti jednaka zbroju šifri: 37141 do 37149 u oba stupca podataka.",null,0,0,{"$f":"IF(ABS('PR-RAS'!D257-SUM('PR-RAS'!D811:D814))>0.001,1,0)","v":0},{"$f":"IF(ABS('PR-RAS'!E257-SUM('PR-RAS'!E811:E814))>0.001,1,0)","v":0}]
[42,"O.K.","Šifra 3721 mora biti jednaka zbroju šifri: 37211 do 37219 u oba stupca podataka.",null,0,0,{"$f":"IF(ABS('PR-RAS'!D260-SUM('PR-RAS'!D815:D823))>0.001,1,0)","v":0},{"$f":"IF(ABS('PR-RAS'!E260-SUM('PR-RAS'!E815:E823))>0.001,1,0)","v":0}]
[43,"O.K.","Šifra 3722 mora biti jednaka zbroju šifri: 37221 do 37229 u oba stupca podataka.",null,0,0,{"$f":"IF(ABS('PR-RAS'!D261-SUM('PR-RAS'!D824:D828))>0.001,1,0)","v":0},{"$f":"IF(ABS('PR-RAS'!E261-SUM('PR-RAS'!E824:E828))>0.001,1,0)","v":0}]
[44,"O.K.","Šifra 38117 je samo dio šifre 3811 i mora joj biti manja ili jednaka u oba stupca podataka.",null,0,0,{"$f":"IF(ROUND('PR-RAS'!D829,2)>ROUND('PR-RAS'!D265,2),1,0)","v":0},{"$f":"IF(ROUND('PR-RAS'!E829,2)>ROUND('PR-RAS'!E265,2),1,0)","v":0}]
[45,"O.K.","Šifra 3861 mora biti jednaka zbroju šifri: 38612 do 38615 u oba stupca podataka.",null,0,0,{"$f":"IF(ABS('PR-RAS'!D280-SUM('PR-RAS'!D830:D833))>0.001,1,0)","v":0},{"$f":"IF(ABS('PR-RAS'!E280-SUM('PR-RAS'!E830:E833))>0.001,1,0)","v":0}]
[46,"O.K.","Šifra 3862 mora biti jednaka zbroju šifri: 38622 do 38626 u oba stupca podataka.",null,0,0,{"$f":"IF(ABS('PR-RAS'!D281-SUM('PR-RAS'!D834:D838))>0.001,1,0)","v":0},{"$f":"IF(ABS('PR-RAS'!E281-SUM('PR-RAS'!E834:E838))>0.001,1,0)","v":0}]
[47,"O.K.","Šifra 3863 mora biti jednaka zbroju šifri: 38631+38632 u oba stupca podataka.",null,0,0,{"$f":"IF(ABS('PR-RAS'!D282-SUM('PR-RAS'!D839:D840))>0.001,1,0)","v":0},{"$f":"IF(ABS('PR-RAS'!E282-SUM('PR-RAS'!E839:E840))>0.001,1,0)","v":0}]
[48,"O.K.","Šifra 3864 mora biti jednaka zbroju šifri: 38641+38642 u oba stupca podataka.",null,0,0,{"$f":"IF(ABS('PR-RAS'!D283-SUM('PR-RAS'!D841:D842))>0.001,1,0)","v":0},{"$f":"IF(ABS('PR-RAS'!E283-SUM('PR-RAS'!E841:E842))>0.001,1,0)","v":0}]
[244,"O.K.","Šifra 3865 mora biti jednaka zbroju šifri: 38651 do 38653 u oba stupca podataka.",null,0,0,{"$f":"IF(ABS('PR-RAS'!D284-SUM('PR-RAS'!D843:D845))>0.001,1,0)","v":0},{"$f":"IF(ABS('PR-RAS'!E284-SUM('PR-RAS'!E843:E845))>0.001,1,0)","v":0}]
[49,"O.K.","Šifra 81212 je samo dio šifre 8121 i mora joj biti manja ili jednaka u oba stupca podataka.",null,0,0,{"$f":"IF(ROUND('PR-RAS'!D846,2)>ROUND('PR-RAS'!D428,2),1,0)","v":0},{"$f":"IF(ROUND('PR-RAS'!E846,2)>ROUND('PR-RAS'!E428,2),1,0)","v":0}]
[50,"O.K.","Šifra 81322 je samo dio šifre 8132 i mora joj biti manja ili jednaka u oba stupca podataka.",null,0,0,{"$f":"IF(ROUND('PR-RAS'!D847,2)>ROUND('PR-RAS'!D431,2),1,0)","v":0},{"$f":"IF(ROUND('PR-RAS'!E847,2)>ROUND('PR-RAS'!E431,2),1,0)","v":0}]
[51,"O.K.","Šifra 81332 je samo dio šifre 8133 i mora joj biti manja ili jednaka u oba stupca podataka.",null,0,0,{"$f":"IF(ROUND('PR-RAS'!D848,2)>ROUND('PR-RAS'!D432,2),1,0)","v":0},{"$f":"IF(ROUND('PR-RAS'!E848,2)>ROUND('PR-RAS'!E432,2),1,0)","v":0}]
[52,"O.K.","Šifra 81342 je samo dio šifre 8134 i mora joj biti manja ili jednaka u oba stupca podataka.",null,0,0,{"$f":"IF(ROUND('PR-RAS'!D849,2)>ROUND('PR-RAS'!D433,2),1,0)","v":0},{"$f":"IF(ROUND('PR-RAS'!E849,2)>ROUND('PR-RAS'!E433,2),1,0)","v":0}]
[53,"O.K.","Šifra 814 mora biti jednaka zbroju šifri: 81411+81412 u oba stupca podataka.",null,0,0,{"$f":"IF(ABS('PR-RAS'!D434-SUM('PR-RAS'!D850:D851))>0.001,1,0)","v":0},{"$f":"IF(ABS('PR-RAS'!E434-SUM('PR-RAS'!E850:E851))>0.001,1,0)","v":0}]
[54,"O.K.","Šifra 81532 je samo dio šifre 8153 i mora joj biti manja ili jednaka u oba stupca podataka.",null,0,0,{"$f":"IF(ROUND('PR-RAS'!D852,2)>ROUND('PR-RAS'!D436,2),1,0)","v":0},{"$f":"IF(ROUND('PR-RAS'!E852,2)>ROUND('PR-RAS'!E436,2),1,0)","v":0}]
[55,"O.K.","Šifra 81542 je samo dio šifre 8154 i mora joj biti manja ili jednaka u oba stupca podataka.",null,0,0,{"$f":"IF(ROUND('PR-RAS'!D853,2)>ROUND('PR-RAS'!D437,2),1,0)","v":0},{"$f":"IF(ROUND('PR-RAS'!E853,2)>ROUND('PR-RAS'!E437,2),1,0)","v":0}]
[56,"O.K.","Šifra 81552 je samo dio šifre 8155 i mora joj biti manja ili jednaka u oba stupca podataka.",null,0,0,{"$f":"IF(ROUND('PR-RAS'!D854,2)>ROUND('PR-RAS'!D438,2),1,0)","v":0},{"$f":"IF(ROUND('PR-RAS'!E854,2)>ROUND('PR-RAS'!E438,2),1,0)","v":0}]
[57,"O.K.","Šifra 8163 mora biti jednaka zbroju šifri: 81631+81632 u oba stupca podataka.",null,0,0,{"$f":"IF(ABS('PR-RAS'!D443-SUM('PR-RAS'!D855:D856))>0.001,1,0)","v":0},{"$f":"IF(ABS('PR-RAS'!E443-SUM('PR-RAS'!E855:E856))>0.001,1,0)","v":0}]
[58,"O.K.","Šifra 8164 mora biti jednaka zbroju šifri: 81641+81642 u oba stupca podataka.",null,{"$f":"MAX(G85:K85)","v":0},0,{"$f":"IF(ABS('PR-RAS'!D444-SUM('PR-RAS'!D857:D858))>0.001,1,0)","v":0},{"$f":"IF(ABS('PR-RAS'!E444-SUM('PR-RAS'!E857:E858))>0.001,1,0)","v":0}]
[59,"O.K.","Šifra 8171 mora biti jednaka zbroju šifri: 81711+81712 u oba stupca podataka.",null,0,{"$f":"MAX(L86:O86)","v":0},{"$f":"IF(ABS('PR-RAS'!D448-SUM('PR-RAS'!D859:D860))>0.001,1,0)","v":0},{"$f":"IF(ABS('PR-RAS'!E448-SUM('PR-RAS'!E859:E860))>0.001,1,0)","v":0}]
[60,"O.K.","Šifra 8172 mora biti jednaka zbroju šifri: 81721+81722 u oba stupca podataka.",null,0,0,{"$f":"IF(ABS('PR-RAS'!D449-SUM('PR-RAS'!D861:D862))>0.001,1,0)","v":0},{"$f":"IF(ABS('PR-RAS'!E449-SUM('PR-RAS'!E861:E862))>0.001,1,0)","v":0}]
[61,"O.K.","Šifra 8173 mora biti jednaka zbroju šifri: 81731+81732 u oba stupca podataka.",null,0,0,{"$f":"IF(ABS('PR-RAS'!D450-SUM('PR-RAS'!D863:D864))>0.001,1,0)","v":0},{"$f":"IF(ABS('PR-RAS'!E450-SUM('PR-RAS'!E863:E864))>0.001,1,0)","v":0}]
[62,"O.K.","Šifra 8174 mora biti jednaka zbroju šifri: 81741+81742 u oba stupca podataka.",null,0,0,{"$f":"IF(ABS('PR-RAS'!D451-SUM('PR-RAS'!D865:D866))>0.001,1,0)","v":0},{"$f":"IF(ABS('PR-RAS'!E451-SUM('PR-RAS'!E865:E866))>0.001,1,0)","v":0}]
[63,"O.K.","Šifra 8175 mora biti jednaka zbroju šifri: 81751+81752 u oba stupca podataka.",null,0,0,{"$f":"IF(ABS('PR-RAS'!D452-SUM('PR-RAS'!D867:D868))>0.001,1,0)","v":0},{"$f":"IF(ABS('PR-RAS'!E452-SUM('PR-RAS'!E867:E868))>0.001,1,0)","v":0}]
[64,"O.K.","Šifra 8176 mora biti jednaka zbroju šifri: 81761+81762 u oba stupca podataka.",null,0,0,{"$f":"IF(ABS('PR-RAS'!D453-SUM('PR-RAS'!D869:D870))>0.001,1,0)","v":0},{"$f":"IF(ABS('PR-RAS'!E453-SUM('PR-RAS'!E869:E870))>0.001,1,0)","v":0}]
[65,"O.K.","Šifra 8177 mora biti jednaka zbroju šifri: 81771+81772 u oba stupca podataka.",null,0,0,{"$f":"IF(ABS('PR-RAS'!D454-SUM('PR-RAS'!D871:D872))>0.001,1,0)","v":0},{"$f":"IF(ABS('PR-RAS'!E454-SUM('PR-RAS'!E871:E872))>0.001,1,0)","v":0}]
[66,"O.K.","Šifra 82412 je samo dio šifre 8241 i mora joj biti manja ili jednaka u oba stupca podataka.",null,0,0,{"$f":"IF(ROUND('PR-RAS'!D873,2)>ROUND('PR-RAS'!D470,2),1,0)","v":0},{"$f":"IF(ROUND('PR-RAS'!E873,2)>ROUND('PR-RAS'!E470,2),1,0)","v":0}]
[67,"O.K.","Šifra 84132 je samo dio šifre 8413 i mora joj biti manja ili jednaka u oba stupca podataka.",null,0,0,{"$f":"IF(ROUND('PR-RAS'!D874,2)>ROUND('PR-RAS'!D486,2),1,0)","v":0},{"$f":"IF(ROUND('PR-RAS'!E874,2)>ROUND('PR-RAS'!E486,2),1,0)","v":0}]
[68,{"$f":"IF(E95=1,\"Pogreška\",IF(F95=1,\"Provjera\",\"O.K.\"))","v":"O.K."},"Šifra 84142 je samo dio šifre 8414 i mora joj biti manja ili jednaka u oba stupca podataka.",null,0,0,{"$f":"IF(ROUND('PR-RAS'!D875,2)>ROUND('PR-RAS'!D487,2),1,0)","v":0},{"$f":"IF(ROUND('PR-RAS'!E875,2)>ROUND('PR-RAS'!E487,2),1,0)","v":0}]
[69,"O.K.","Šifra 84152 je samo dio šifre 8415 i mora joj biti manja ili jednaka u oba stupca podataka.",null,0,0,{"$f":"IF(ROUND('PR-RAS'!D876,2)>ROUND('PR-RAS'!D488,2),1,0)","v":0},{"$f":"IF(ROUND('PR-RAS'!E876,2)>ROUND('PR-RAS'!E488,2),1,0)","v":0}]
[70,"O.K.","Šifra 84162 je samo dio šifre 8416 i mora joj biti manja ili jednaka u oba stupca podataka.",null,0,0,{"$f":"IF(ROUND('PR-RAS'!D877,2)>ROUND('PR-RAS'!D489,2),1,0)","v":0},{"$f":"IF(ROUND('PR-RAS'!E877,2)>ROUND('PR-RAS'!E489,2),1,0)","v":0}]
[71,"O.K.","Zbroj šifri: 84221 do 84223 je samo dio šifre 8422 i mora joj biti manji ili jednak u oba stupca podataka.",null,0,0,{"$f":"IF(ROUND(SUM('PR-RAS'!D878:D880),2)>ROUND('PR-RAS'!D491,2),1,0)","v":0},{"$f":"IF(ROUND(SUM('PR-RAS'!E878:E880),2)>ROUND('PR-RAS'!E491,2),1,0)","v":0}]
[72,"O.K.","Šifra 84232 je samo dio šifre 8423 i mora joj biti manja ili jednaka u oba stupca podataka.",null,0,0,{"$f":"IF(ROUND('PR-RAS'!D881,2)>ROUND('PR-RAS'!D492,2),1,0)","v":0},{"$f":"IF(ROUND('PR-RAS'!E881,2)>ROUND('PR-RAS'!E492,2),1,0)","v":0}]
[73,"O.K.","Zbroj šifri: 84242+84243 je samo dio šifre 8424 i mora joj biti manji ili jednak u oba stupca podataka.",null,0,0,{"$f":"IF(ROUND(SUM('PR-RAS'!D882:D883),2)>ROUND('PR-RAS'!D493,2),1,0)","v":0},{"$f":"IF(ROUND(SUM('PR-RAS'!E882:E883),2)>ROUND('PR-RAS'!E493,2),1,0)","v":0}]
[74,"O.K.","Šifra 84312 je samo dio šifre 843 i mora joj biti manja ili jednaka u oba stupca podataka.",null,0,0,{"$f":"IF(ROUND('PR-RAS'!D884,2)>ROUND('PR-RAS'!D494,2),1,0)","v":0},{"$f":"IF(ROUND('PR-RAS'!E884,2)>ROUND('PR-RAS'!E494,2),1,0)","v":0}]
[75,"O.K.","Zbroj šifri: 84431 do 84433 je samo dio šifre 8443 i mora joj biti manji ili jednak u oba stupca podataka.",null,0,0,{"$f":"IF(ROUND(SUM('PR-RAS'!D885:D887),2)>ROUND('PR-RAS'!D496,2),1,0)","v":0},{"$f":"IF(ROUND(SUM('PR-RAS'!E885:E887),2)>ROUND('PR-RAS'!E496,2),1,0)","v":0}]
[76,"O.K.","Šifra 84442 je samo dio šifre 8444 i mora joj biti manja ili jednaka u oba stupca podataka.",null,0,0,{"$f":"IF(ROUND('PR-RAS'!D888,2)>ROUND('PR-RAS'!D497,2),1,0)","v":0},{"$f":"IF(ROUND('PR-RAS'!E888,2)>ROUND('PR-RAS'!E497,2),1,0)","v":0}]
[77,"O.K.","Zbroj šifri: 84452+84453 je samo dio šifre 8445 i mora joj biti manji ili jednak u oba stupca podataka.",null,0,0,{"$f":"IF(ROUND(SUM('PR-RAS'!D889:D890),2)>ROUND('PR-RAS'!D498,2),1,0)","v":0},{"$f":"IF(ROUND(SUM('PR-RAS'!E889:E890),2)>ROUND('PR-RAS'!E498,2),1,0)","v":0}]
[78,"O.K.","Zbroj šifri: 84461 do 84463 je samo dio šifre 8446 i mora joj biti manji ili jednak u oba stupca podataka.",null,0,0,{"$f":"IF(ROUND(SUM('PR-RAS'!D891:D893),2)>ROUND('PR-RAS'!D499,2),1,0)","v":0},{"$f":"IF(ROUND(SUM('PR-RAS'!E891:E893),2)>ROUND('PR-RAS'!E499,2),1,0)","v":0}]
[79,"O.K.","Šifra 84472 je samo dio šifre 8447 i mora joj biti manja ili jednaka u oba stupca podataka.",null,0,0,{"$f":"IF(ROUND('PR-RAS'!D894,2)>ROUND('PR-RAS'!D500,2),1,0)","v":0},{"$f":"IF(ROUND('PR-RAS'!E894,2)>ROUND('PR-RAS'!E500,2),1,0)","v":0}]
[80,"O.K.","Zbroj šifri: 84482+84483 je samo dio šifre 8448 i mora joj biti manji ili jednak u oba stupca podataka.",null,0,0,{"$f":"IF(ROUND(SUM('PR-RAS'!D895:D896),2)>ROUND('PR-RAS'!D501,2),1,0)","v":0},{"$f":"IF(ROUND(SUM('PR-RAS'!E895:E896),2)>ROUND('PR-RAS'!E501,2),1,0)","v":0}]
[81,"O.K.","Šifra 84532 je samo dio šifre 8453 i mora joj biti manja ili jednaka u oba stupca podataka.",null,0,0,{"$f":"IF(ROUND('PR-RAS'!D897,2)>ROUND('PR-RAS'!D503,2),1,0)","v":0},{"$f":"IF(ROUND('PR-RAS'!E897,2)>ROUND('PR-RAS'!E503,2),1,0)","v":0}]
[82,"O.K.","Šifra 84542 je samo dio šifre 8454 i mora joj biti manja ili jednaka u oba stupca podataka.",null,0,0,{"$f":"IF(ROUND('PR-RAS'!D898,2)>ROUND('PR-RAS'!D504,2),1,0)","v":0},{"$f":"IF(ROUND('PR-RAS'!E898,2)>ROUND('PR-RAS'!E504,2),1,0)","v":0}]
[83,"O.K.","Šifra 84552 je samo dio šifre 8455 i mora joj biti manja ili jednaka u oba stupca podataka.",null,0,0,{"$f":"IF(ROUND('PR-RAS'!D899,2)>ROUND('PR-RAS'!D505,2),1,0)","v":0},{"$f":"IF(ROUND('PR-RAS'!E899,2)>ROUND('PR-RAS'!E505,2),1,0)","v":0}]
[84,"O.K.","Šifra 8471 mora biti jednaka zbroju šifri: 84711+84712 u oba stupca podataka.",null,0,0,{"$f":"IF(ABS('PR-RAS'!D508-'PR-RAS'!D900-'PR-RAS'!D901)>0.001,1,0)","v":0},{"$f":"IF(ABS('PR-RAS'!E508-'PR-RAS'!E900-'PR-RAS'!E901)>0.001,1,0)","v":0}]
[85,"O.K.","Šifra 8472 mora biti jednaka zbroju šifri: 84721+84722 u oba stupca podataka.",null,0,0,{"$f":"IF(ABS('PR-RAS'!D509-'PR-RAS'!D902-'PR-RAS'!D903)>0.001,1,0)","v":0},{"$f":"IF(ABS('PR-RAS'!E509-'PR-RAS'!E902-'PR-RAS'!E903)>0.001,1,0)","v":0}]
[86,"O.K.","Šifra 8473 mora biti jednaka zbroju šifri: 84731+84732 u oba stupca podataka.",null,0,0,{"$f":"IF(ABS('PR-RAS'!D510-'PR-RAS'!D904-'PR-RAS'!D905)>0.001,1,0)","v":0},{"$f":"IF(ABS('PR-RAS'!E510-'PR-RAS'!E904-'PR-RAS'!E905)>0.001,1,0)","v":0}]
[87,"O.K.","Šifra 8474 mora biti jednaka zbroju šifri: 84741+84742 u oba stupca podataka.",null,0,0,{"$f":"IF(ABS('PR-RAS'!D511-'PR-RAS'!D906-'PR-RAS'!D907)>0.001,1,0)","v":0},{"$f":"IF(ABS('PR-RAS'!E511-'PR-RAS'!E906-'PR-RAS'!E907)>0.001,1,0)","v":0}]
[88,"O.K.","Šifra 8475 mora biti jednaka zbroju šifri: 84751+84752 u oba stupca podataka.",null,0,0,{"$f":"IF(ABS('PR-RAS'!D512-'PR-RAS'!D908-'PR-RAS'!D909)>0.001,1,0)","v":0},{"$f":"IF(ABS('PR-RAS'!E512-'PR-RAS'!E908-'PR-RAS'!E909)>0.001,1,0)","v":0}]
[89,"O.K.","Šifra 8476 mora biti jednaka zbroju šifri: 84761+84762 u oba stupca podataka.",null,0,0,{"$f":"IF(ABS('PR-RAS'!D513-'PR-RAS'!D910-'PR-RAS'!D911)>0.001,1,0)","v":0},{"$f":"IF(ABS('PR-RAS'!E513-'PR-RAS'!E910-'PR-RAS'!E911)>0.001,1,0)","v":0}]
[90,"O.K.","Šifra 8477 mora biti jednaka zbroju šifri: 84771+84772 u oba stupca podataka.",null,0,0,{"$f":"IF(ABS('PR-RAS'!D514-'PR-RAS'!D912-'PR-RAS'!D913)>0.001,1,0)","v":0},{"$f":"IF(ABS('PR-RAS'!E514-'PR-RAS'!E912-'PR-RAS'!E913)>0.001,1,0)","v":0}]
[91,"O.K.","Šifra 85412 je samo dio šifre 8541 i mora joj biti manja ili jednaka u oba stupca podataka.",null,0,0,{"$f":"IF(ROUND('PR-RAS'!D914,2)>ROUND('PR-RAS'!D526,2),1,0)","v":0},{"$f":"IF(ROUND('PR-RAS'!E914,2)>ROUND('PR-RAS'!E526,2),1,0)","v":0}]
[92,"O.K.","Šifra 51212 je samo dio šifre 5121 i mora joj biti manja ili jednaka u oba stupca podataka.",null,0,0,{"$f":"IF(ROUND('PR-RAS'!D915,2)>ROUND('PR-RAS'!D536,2),1,0)","v":0},{"$f":"IF(ROUND('PR-RAS'!E915,2)>ROUND('PR-RAS'!E536,2),1,0)","v":0}]
[93,"O.K.","Šifra 51322 je samo dio šifre 5132 i mora joj biti manja ili jednaka u oba stupca podataka.",null,0,0,{"$f":"IF(ROUND('PR-RAS'!D916,2)>ROUND('PR-RAS'!D539,2),1,0)","v":0},{"$f":"IF(ROUND('PR-RAS'!E916,2)>ROUND('PR-RAS'!E539,2),1,0)","v":0}]
[94,"O.K.","Šifra 51332 je samo dio šifre 5133 i mora joj biti manja ili jednaka u oba stupca podataka.",null,0,0,{"$f":"IF(ROUND('PR-RAS'!D917,2)>ROUND('PR-RAS'!D540,2),1,0)","v":0},{"$f":"IF(ROUND('PR-RAS'!E917,2)>ROUND('PR-RAS'!E540,2),1,0)","v":0}]
[95,"O.K.","Šifra 51342 je samo dio šifre 5134 i mora joj biti manja ili jednaka u oba stupca podataka.",null,0,0,{"$f":"IF(ROUND('PR-RAS'!D918,2)>ROUND('PR-RAS'!D541,2),1,0)","v":0},{"$f":"IF(ROUND('PR-RAS'!E918,2)>ROUND('PR-RAS'!E541,2),1,0)","v":0}]
[96,"O.K.","Šifra 514 mora biti jednaka zbroju šifri: 51411+51412 u oba stupca podataka.",null,0,0,{"$f":"IF(ABS('PR-RAS'!D542-SUM('PR-RAS'!D919:D920))>0.001,1,0)","v":0},{"$f":"IF(ABS('PR-RAS'!E542-SUM('PR-RAS'!E919:E920))>0.001,1,0)","v":0}]
[97,"O.K.","Šifra 51532 je samo dio šifre 5153 i mora joj biti manja ili jednaka u oba stupca podataka.",null,0,0,{"$f":"IF(ROUND(SUM('PR-RAS'!D921:D921),2)>ROUND('PR-RAS'!D544,2),1,0)","v":0},{"$f":"IF(ROUND(SUM('PR-RAS'!E921:E921),2)>ROUND('PR-RAS'!E544,2),1,0)","v":0}]
[98,"O.K.","Šifra 51542 je samo dio šifre 5154 i mora joj biti manja ili jednaka u oba stupca podataka.",null,0,0,{"$f":"IF(ROUND(SUM('PR-RAS'!D922:D922),2)>ROUND('PR-RAS'!D545,2),1,0)","v":0},{"$f":"IF(ROUND(SUM('PR-RAS'!E922:E922),2)>ROUND('PR-RAS'!E545,2),1,0)","v":0}]
[99,"O.K.","Šifra 51552 je samo dio šifre 5155 i mora joj biti manja ili jednaka u oba stupca podataka.",null,0,0,{"$f":"IF(ROUND(SUM('PR-RAS'!D923:D923),2)>ROUND('PR-RAS'!D546,2),1,0)","v":0},{"$f":"IF(ROUND(SUM('PR-RAS'!E923:E923),2)>ROUND('PR-RAS'!E546,2),1,0)","v":0}]
[100,"O.K.","Šifra 5163 mora biti jednaka zbroju šifri: 51631+51632 u oba stupca podataka.",null,0,0,{"$f":"IF(ABS('PR-RAS'!D551-SUM('PR-RAS'!D924:D925))>0.001,1,0)","v":0},{"$f":"IF(ABS('PR-RAS'!E551-SUM('PR-RAS'!E924:E925))>0.001,1,0)","v":0}]
[101,"O.K.","Šifra 5164 mora biti jednaka zbroju šifri: 51641+51642 u oba stupca podataka.",null,0,0,{"$f":"IF(ABS('PR-RAS'!D552-SUM('PR-RAS'!D926:D927))>0.001,1,0)","v":0},{"$f":"IF(ABS('PR-RAS'!E552-SUM('PR-RAS'!E926:E927))>0.001,1,0)","v":0}]
[102,"O.K.","Šifra 5171 mora biti jednaka zbroju šifri: 51711+51712 u oba stupca podataka.",null,0,0,{"$f":"IF(ABS('PR-RAS'!D556-SUM('PR-RAS'!D928:D929))>0.001,1,0)","v":0},{"$f":"IF(ABS('PR-RAS'!E556-SUM('PR-RAS'!E928:E929))>0.001,1,0)","v":0}]
[103,"O.K.","Šifra 5172 mora biti jednaka zbroju šifri: 51721+51722 u oba stupca podataka.",null,0,0,{"$f":"IF(ABS('PR-RAS'!D557-SUM('PR-RAS'!D930:D931))>0.001,1,0)","v":0},{"$f":"IF(ABS('PR-RAS'!E557-SUM('PR-RAS'!E930:E931))>0.001,1,0)","v":0}]
[104,"O.K.","Šifra 5173 mora biti jednaka zbroju šifri: 51731+51732 u oba stupca podataka.",null,0,0,{"$f":"IF(ABS('PR-RAS'!D558-SUM('PR-RAS'!D932:D933))>0.001,1,0)","v":0},{"$f":"IF(ABS('PR-RAS'!E558-SUM('PR-RAS'!E932:E933))>0.001,1,0)","v":0}]
[105,"O.K.","Šifra 5174 mora biti jednaka zbroju šifri: 51741+51742 u oba stupca podataka.",null,0,0,{"$f":"IF(ABS('PR-RAS'!D559-SUM('PR-RAS'!D934:D935))>0.001,1,0)","v":0},{"$f":"IF(ABS('PR-RAS'!E559-SUM('PR-RAS'!E934:E935))>0.001,1,0)","v":0}]
[106,"O.K.","Šifra 5175 mora biti jednaka zbroju šifri: 51751+51752 u oba stupca podataka.",null,0,0,{"$f":"IF(ABS('PR-RAS'!D560-SUM('PR-RAS'!D936:D937))>0.001,1,0)","v":0},{"$f":"IF(ABS('PR-RAS'!E560-SUM('PR-RAS'!E936:E937))>0.001,1,0)","v":0}]
[107,"O.K.","Šifra 5176 mora biti jednaka zbroju šifri: 51761+51762 u oba stupca podataka.",null,0,0,{"$f":"IF(ABS('PR-RAS'!D561-SUM('PR-RAS'!D938:D939))>0.001,1,0)","v":0},{"$f":"IF(ABS('PR-RAS'!E561-SUM('PR-RAS'!E938:E939))>0.001,1,0)","v":0}]
[108,"O.K.","Šifra 5177 mora biti jednaka zbroju šifri: 51771+51772 u oba stupca podataka.",null,0,0,{"$f":"IF(ABS('PR-RAS'!D562-SUM('PR-RAS'!D940:D941))>0.001,1,0)","v":0},{"$f":"IF(ABS('PR-RAS'!E562-SUM('PR-RAS'!E940:E941))>0.001,1,0)","v":0}]
[109,"O.K.","Šifra 54132 je samo dio šifre 5413 i mora joj biti manja ili jednaka u oba stupca podataka.",null,0,0,{"$f":"IF(ROUND('PR-RAS'!D942,2)>ROUND('PR-RAS'!D595,2),1,0)","v":0},{"$f":"IF(ROUND('PR-RAS'!E942,2)>ROUND('PR-RAS'!E595,2),1,0)","v":0}]
[110,"O.K.","Šifra 54142 je samo dio šifre 5414 i mora joj biti manja ili jednaka u oba stupca podataka.",null,0,0,{"$f":"IF(ROUND('PR-RAS'!D943,2)>ROUND('PR-RAS'!D596,2),1,0)","v":0},{"$f":"IF(ROUND('PR-RAS'!E943,2)>ROUND('PR-RAS'!E596,2),1,0)","v":0}]
[111,"O.K.","Šifra 54152 je samo dio šifre 5415 i mora joj biti manja ili jednaka u oba stupca podataka.",null,0,0,{"$f":"IF(ROUND('PR-RAS'!D944,2)>ROUND('PR-RAS'!D597,2),1,0)","v":0},{"$f":"IF(ROUND('PR-RAS'!E944,2)>ROUND('PR-RAS'!E597,2),1,0)","v":0}]
[112,"O.K.","Šifra 54162 je samo dio šifre 5416 i mora joj biti manja ili jednaka u oba stupca podataka.",null,0,0,{"$f":"IF(ROUND('PR-RAS'!D945,2)>ROUND('PR-RAS'!D598,2),1,0)","v":0},{"$f":"IF(ROUND('PR-RAS'!E945,2)>ROUND('PR-RAS'!E598,2),1,0)","v":0}]
[113,"O.K.","Zbroj šifri: 54221 do 54223 je samo dio šifre 5422 i mora joj biti manji ili jednak u oba stupca podataka.",null,0,0,{"$f":"IF(ROUND(SUM('PR-RAS'!D946:D948),2)>ROUND('PR-RAS'!D600,2),1,0)","v":0},{"$f":"IF(ROUND(SUM('PR-RAS'!E946:E948),2)>ROUND('PR-RAS'!E600,2),1,0)","v":0}]
[114,"O.K.","Šifra 54232 je samo dio šifre 5423 i mora joj biti manja ili jednaka u oba stupca podataka.",null,0,0,{"$f":"IF(ROUND('PR-RAS'!D949,2)>ROUND('PR-RAS'!D601,2),1,0)","v":0},{"$f":"IF(ROUND('PR-RAS'!E949,2)>ROUND('PR-RAS'!E601,2),1,0)","v":0}]
[115,"O.K.","Zbroj šifri: 54242+54243 je samo dio šifre 5424 i mora joj biti manji ili jednak u oba stupca podataka.",null,0,0,{"$f":"IF(ROUND('PR-RAS'!D950+'PR-RAS'!D951,2)>ROUND('PR-RAS'!D602,2),1,0)","v":0},{"$f":"IF(ROUND('PR-RAS'!E950+'PR-RAS'!E951,2)>ROUND('PR-RAS'!E602,2),1,0)","v":0}]
[116,"O.K.","Šifra 54312 je samo dio šifre 543 i mora joj biti manja ili jednaka u oba stupca podataka.",null,0,0,{"$f":"IF(ROUND('PR-RAS'!D952,2)>ROUND('PR-RAS'!D603,2),1,0)","v":0},{"$f":"IF(ROUND('PR-RAS'!E952,2)>ROUND('PR-RAS'!E603,2),1,0)","v":0}]
[117,"O.K.","Zbroj šifri: 54431 do 54433 je samo dio šifre 5443 i mora joj biti manji ili jednak u oba stupca podataka.",null,0,0,{"$f":"IF(ROUND(SUM('PR-RAS'!D953:D955),2)>ROUND('PR-RAS'!D606,2),1,0)","v":0},{"$f":"IF(ROUND(SUM('PR-RAS'!E953:E955),2)>ROUND('PR-RAS'!E606,2),1,0)","v":0}]
[118,"O.K.","Šifra 54442 je samo dio šifre 5444 i mora joj biti manja ili jednaka u oba stupca podataka.",null,0,0,{"$f":"IF(ROUND('PR-RAS'!D956,2)>ROUND('PR-RAS'!D607,2),1,0)","v":0},{"$f":"IF(ROUND('PR-RAS'!E956,2)>ROUND('PR-RAS'!E607,2),1,0)","v":0}]
[119,"O.K.","Zbroj šifri: 54452+54453 je samo dio šifre 5445 i mora joj biti manji ili jednak u oba stupca podataka.",null,0,0,{"$f":"IF(ROUND(SUM('PR-RAS'!D957:D958),2)>ROUND('PR-RAS'!D608,2),1,0)","v":0},{"$f":"IF(ROUND(SUM('PR-RAS'!E957:E958),2)>ROUND('PR-RAS'!E608,2),1,0)","v":0}]
[120,"O.K.","Zbroj šifri: 54461 do 54463 je samo dio šifre 5446 i mora joj biti manji ili jednak u oba stupca podataka.",null,0,0,{"$f":"IF(ROUND(SUM('PR-RAS'!D959:D961),2)>ROUND('PR-RAS'!D609,2),1,0)","v":0},{"$f":"IF(ROUND(SUM('PR-RAS'!E959:E961),2)>ROUND('PR-RAS'!E609,2),1,0)","v":0}]
[121,"O.K.","Šifra 54472 je samo dio šifre 5447 i mora joj biti manja ili jednaka u oba stupca podataka.",null,0,0,{"$f":"IF(ROUND('PR-RAS'!D962,2)>ROUND('PR-RAS'!D610,2),1,0)","v":0},{"$f":"IF(ROUND('PR-RAS'!E962,2)>ROUND('PR-RAS'!E610,2),1,0)","v":0}]
[122,"O.K.","Zbroj šifri: 54482+54483 je samo dio šifre 5448 i mora joj biti manji ili jednak u oba stupca podataka.",null,{"$f":"MAX(G149:K149)","v":0},0,{"$f":"IF(ROUND(SUM('PR-RAS'!D963:D964),2)>ROUND('PR-RAS'!D611,2),1,0)","v":0},{"$f":"IF(ROUND(SUM('PR-RAS'!E963:E964),2)>ROUND('PR-RAS'!E611,2),1,0)","v":0}]
[123,"O.K.","Šifra 54532 je samo dio šifre 5453 i mora joj biti manja ili jednaka u oba stupca podataka.",null,0,{"$f":"MAX(L150:O150)","v":0},{"$f":"IF(ROUND('PR-RAS'!D965,2)>ROUND('PR-RAS'!D613,2),1,0)","v":0},{"$f":"IF(ROUND('PR-RAS'!E965,2)>ROUND('PR-RAS'!E613,2),1,0)","v":0}]
[124,"O.K.","Šifra 54542 je samo dio šifre 5454 i mora joj biti manja ili jednaka u oba stupca podataka.",null,0,0,{"$f":"IF(ROUND('PR-RAS'!D966,2)>ROUND('PR-RAS'!D614,2),1,0)","v":0},{"$f":"IF(ROUND('PR-RAS'!E966,2)>ROUND('PR-RAS'!E614,2),1,0)","v":0}]
[125,"O.K.","Šifra 54552 je samo dio šifre 5455 i mora joj biti manja ili jednaka u oba stupca podataka.",null,0,0,{"$f":"IF(ROUND('PR-RAS'!D967,2)>ROUND('PR-RAS'!D615,2),1,0)","v":0},{"$f":"IF(ROUND('PR-RAS'!E967,2)>ROUND('PR-RAS'!E615,2),1,0)","v":0}]
[126,"O.K.","Šifra 5471 mora biti jednaka zbroju šifri: 54711+54712 u oba stupca podataka.",null,0,0,{"$f":"IF(ABS('PR-RAS'!D618-SUM('PR-RAS'!D968:D969))>0.001,1,0)","v":0},{"$f":"IF(ABS('PR-RAS'!E618-SUM('PR-RAS'!E968:E969))>0.001,1,0)","v":0}]
[127,"O.K.","Šifra 5472 mora biti jednaka zbroju šifri: 54721+54722 u oba stupca podataka.",null,0,0,{"$f":"IF(ABS('PR-RAS'!D619-SUM('PR-RAS'!D970:D971))>0.001,1,0)","v":0},{"$f":"IF(ABS('PR-RAS'!E619-SUM('PR-RAS'!E970:E971))>0.001,1,0)","v":0}]
[128,"O.K.","Šifra 5473 mora biti jednaka zbroju šifri: 54731+54732 u oba stupca podataka.",null,0,0,{"$f":"IF(ABS('PR-RAS'!D620-SUM('PR-RAS'!D972:D973))>0.001,1,0)","v":0},{"$f":"IF(ABS('PR-RAS'!E620-SUM('PR-RAS'!E972:E973))>0.001,1,0)","v":0}]
[129,"O.K.","Šifra 5474 mora biti jednaka zbroju šifri: 54741+54742 u oba stupca podataka.",null,0,0,{"$f":"IF(ABS('PR-RAS'!D621-SUM('PR-RAS'!D974:D975))>0.001,1,0)","v":0},{"$f":"IF(ABS('PR-RAS'!E621-SUM('PR-RAS'!E974:E975))>0.001,1,0)","v":0}]
[130,"O.K.","Šifra 5475 mora biti jednaka zbroju šifri: 54751+54752 u oba stupca podataka.",null,0,0,{"$f":"IF(ABS('PR-RAS'!D622-SUM('PR-RAS'!D976:D977))>0.001,1,0)","v":0},{"$f":"IF(ABS('PR-RAS'!E622-SUM('PR-RAS'!E976:E977))>0.001,1,0)","v":0}]
[131,"O.K.","Šifra 5476 mora biti jednaka zbroju šifri: 54761+54762 u oba stupca podataka.",null,0,0,{"$f":"IF(ABS('PR-RAS'!D623-SUM('PR-RAS'!D978:D979))>0.001,1,0)","v":0},{"$f":"IF(ABS('PR-RAS'!E623-SUM('PR-RAS'!E978:E979))>0.001,1,0)","v":0}]
[132,"O.K.","Šifra 5477 mora biti jednaka zbroju šifri: 54771+54772 u oba stupca podataka.",null,0,0,{"$f":"IF(ABS('PR-RAS'!D624-SUM('PR-RAS'!D980:D981))>0.001,1,0)","v":0},{"$f":"IF(ABS('PR-RAS'!E624-SUM('PR-RAS'!E980:E981))>0.001,1,0)","v":0}]
[133,"O.K.","Šifra 55312 je samo dio šifre 5531 i mora joj biti manja ili jednaka u oba stupca podataka.",null,0,0,{"$f":"IF(ROUND('PR-RAS'!D982,2)>ROUND('PR-RAS'!D633,2),1,0)","v":0},{"$f":"IF(ROUND('PR-RAS'!E982,2)>ROUND('PR-RAS'!E633,2),1,0)","v":0}]
[135,"O.K.","Obveznici razine 11 ne mogu imati popunjene šifre: 611 do 6117. Iznimka od tog pravila je obveznik s RKP-om 47123. Ako ova kontrola javlja pogrešku znači da je za obrazac razine 11 unesen iznos za neku od ovih šifri.",null,0,0,{"$f":"IF(AND(I3=11,O3<>47123,OR(MAX('PR-RAS'!D8:E15)>0,MIN('PR-RAS'!D8:E15)<0)),1,0)","v":0}]
[136,"O.K.","Obveznici razine 11 ne mogu imati popunjene šifre: 614 i 6148. Iznimka od ovog pravila su neki obveznici koji iznimno mogu. Ako ova kontrola javlja pogrešku, znači da su ove šifre popunjene ali se ne radi o obvezniku koji ih može imati popunjene.",null,0,0,{"$f":"IF(AND(I3=11,MAX('PR-RAS'!D29:E29,'PR-RAS'!D36:E36)>0,O3<>51,O3<>22275,O3<>44926,O3<>47439,O3<>43214,O3<>47037,O3<>721,O3<>47053,O3<>756,O3<>49075,O3<>1222,O3<>47107,O3<>26346,O3<>47096,O3<>51409,O3<>51441,O3<>47668,O3<>24086,O3<>20727,O3<>3164,O3<>3172,O3<>50395,O3<>3197,O3<>3201,O3<>3156,O3<>46614,O3<>3210,O3<>3228,O3<>3236,O3<>3244,O3<>3252,O3<>50400,O3<>3277,O3<>3285,O3<>3293,O3<>3308,O3<>3316,O3<>3324,O3<>3332,O3<>3349,O3<>3148),1,0)","v":0}]
[137,"O.K.","Obveznici razine 11 ne mogu imati popunjene šifre: 6119 do 6135, 6141 do 6147, 615 do 6152, 621 do 623, 6811, 367 do 3674 i 3711. Ako je za bilo koju od ovih šifri upisan iznos, a obrazac je razine 11, kontrola javlja grešku i obrazac je neispravan. ",null,0,0,{"$f":"IF(AND(I3=11,MAX('PR-RAS'!D16:E28,'PR-RAS'!D30:E35,'PR-RAS'!D37:E39,'PR-RAS'!D45:E49,'PR-RAS'!D141:E141,'PR-RAS'!D240:E243,'PR-RAS'!D254:E254)>0),1,0)","v":0}]
[245,{"$f":"IF(E164=1,\"Pogreška\",IF(F164=1,\"Provjera\",\"O.K.\"))","v":"O.K."},"Obveznici razine 11 ne mogu imati popunjenu šifru 3421. Iznimka su obveznici s RKP-om 51255, 51263, 51271, 51280, 51298, 51302, 51319, 51327, 51335, 51343. ",null,0,0,{"$f":"IF(AND(I3=11,MAX('PR-RAS'!D209:E209)>0,O3<>51255,O3<>51263,O3<>51343,O3<>51319,O3<>51298,O3<>51302,O3<>51327,O3<>51335,O3<>51280,O3<>51271),1,0)","v":0}]
[138,"O.K.","Obveznici razine 11 ne mogu imati popunjenu šifru 3712 osim obveznika s RKP-om: 47107. Ako ova kontrola javlja pogrešku znači da je za obrazac razine 11 unesen iznos za šifru 3712.",null,0,0,{"$f":"IF(AND(I3=11,O3<>47107,MAX('PR-RAS'!D255:E255)>0),1,0)","v":0},{"$f":"IF(AND(I3=11,O3<>47107,MIN('PR-RAS'!D255:E255)<0),1,0)","v":0}]
[139,"O.K.","Razina 11 ne smije imati popunjene šifre: 8114 do 8116, 8122, 8156 do 8158, 8165, 8166, 8211, 8212, 8222 do 8232, 8242, 8342, 8415 do 8416, 8447 i 8448. Ako je za bilo koju od ovih šifri upisan iznos, a obrazac je razine 11, kontrola javlja grešku i obrazac je neispravan.",null,0,0,{"$f":"IF(AND(I3=11,MAX('PR-RAS'!D424:E426,'PR-RAS'!D429:E429,'PR-RAS'!D439:E441,'PR-RAS'!D445:E445,'PR-RAS'!D446:E446,'PR-RAS'!D461:E461,'PR-RAS'!D462:E462,'PR-RAS'!D465:E468,'PR-RAS'!D471:E471,'PR-RAS'!D483:E483,'PR-RAS'!D488:E489,'PR-RAS'!D500:E500,'PR-RAS'!D501:E501)>0),1,0)","v":0},{"$f":"IF(AND(I3=11,MIN('PR-RAS'!D424:E426,'PR-RAS'!D429:E429,'PR-RAS'!D439:E441,'PR-RAS'!D445:E445,'PR-RAS'!D446:E446,'PR-RAS'!D461:E461,'PR-RAS'!D462:E462,'PR-RAS'!D465:E468,'PR-RAS'!D471:E471,'PR-RAS'!D483:E483,'PR-RAS'!D488:E489,'PR-RAS'!D500:E500,'PR-RAS'!D501:E501)<0),1,0)","v":0}]
[246,"O.K.","Obveznici razine 11 ne smiju imati popunjenu šifru 8121. Iznimka su obveznici s RKP-om 174, 713, 999, 1966, 2436, 2452, 20157, 22058, 40834 i 47037.",null,0,0,{"$f":"IF(AND(I3=11,O3<>174,O3<>713,O3<>999,O3<>1966,O3<>2436,O3<>2452,O3<>20157,O3<>22058,O3<>40834,O3<>47037,MAX('PR-RAS'!D428:E428)>0),1,0)","v":0}]
[247,"O.K.","Obveznici razine 11 ne smiju imati popunjenu šifru 8413. Iznimka su obveznici s RKP-om 1087, 1222, 6120, 47061, 47107, 51441 i 51724.",null,0,0,{"$f":"IF(AND(I3=11,O3<>1087,O3<>1222,O3<>6120,O3<>47061,O3<>47107,O3<>51441,O3<>51724,MAX('PR-RAS'!D486:E486)>0),1,0)","v":0}]
[248,"O.K.","Obveznici razine 11 ne smiju imati popunjenu šifru 8414. Iznimka su obveznici s RKP-om 1079, 46237, 47053 i 47061.",null,0,0,{"$f":"IF(AND(I3=11,O3<>1079,O3<>46237,O3<>47053,O3<>47061,MAX('PR-RAS'!D487:E487)>0),1,0)","v":0}]
[140,"O.K.","Obveznici razine 11 ne mogu imati popunjenu šifru 8455 i 5455 osim obveznika s RKP-om 721. Ako je za bilo koju od ovih šifri upisan iznos, a obrazac je razine 11, kontrola javlja grešku i obrazac je neispravan. ",null,0,0,{"$f":"IF(AND(I3=11,O3<>721,OR(MAX('PR-RAS'!D505:E505,'PR-RAS'!D615:E615)>0,MIN('PR-RAS'!D505:E505,'PR-RAS'!D615:E615)<0)),1,0)","v":0}]
[141,"O.K.","Razina 11 ne smije imati popunjene šifre: 8456, 8512, 8522, 8542, 511 do 5116, 5156 do 5158, 5165, 5166, 5212, 5222, 5241 i 5242. Ako je za bilo koju od ovih šifri upisan iznos, a obrazac je razine 11, kontrola javlja grešku i obrazac je neispravan.",null,0,0,{"$f":"IF(AND(I3=11,O3<>721,MAX('PR-RAS'!D506:E506,'PR-RAS'!D518:E518,'PR-RAS'!D521:E521,'PR-RAS'!D527:E527,'PR-RAS'!D530:E534,'PR-RAS'!D547:E549,'PR-RAS'!D553:E554,'PR-RAS'!D570:E570,'PR-RAS'!D573:E573,'PR-RAS'!D578:E579)>0),1,0)","v":0}]
[142,"O.K.","Obveznici razine 11 ne mogu imati popunjenu šifru 5332 osim obveznika s RKP-om: 46237. Ako ova kontrola javlja pogrešku znači da je za obrazac razine 11 unesen iznos za šifru 5332.",null,0,0,{"$f":"IF(AND(I3=11,O3<>46237,OR(MAX('PR-RAS'!D589:E589)>0,MIN('PR-RAS'!D589:E589)<0)),1,0)","v":0}]
[143,"O.K.","Obveznici razine 11 ne mogu imati popunjene šifre: 541 do 5416. Iznimka su obveznici s RKP-om: 174, 51255, 51263, 51271, 51280, 51298, 51302, 51319, 51327, 51335, 51343. Ako ova kontrola javlja pogrešku znači da je za obrazac razine 11 unesen iznos za jednu od ovih šifri.",null,0,0,{"$f":"IF(AND(I3=11,O3<>174,O3<>51255,O3<>51263,O3<>51271,O3<>51280,O3<>51298,O3<>51302,O3<>51319,O3<>51327,O3<>51335,O3<>51343,OR(MAX('PR-RAS'!D594:E598)>0,MIN('PR-RAS'!D594:E598)<0)),1,0)","v":0}]
[144,"O.K.","Razina 11 ne smije imati popunjene šifre: 5342, 5447, 5448, 5454, 551, 5512, 5522, 5532, 65265, 34112, 34132, 34192. Ako je za bilo koju od ovih šifri upisan iznos, a obrazac je razine 11, kontrola javlja grešku i obrazac je neispravan.",null,0,0,{"$f":"IF(AND(I3=11,MAX('PR-RAS'!D592:E592,'PR-RAS'!D610:E610,'PR-RAS'!D611:E611,'PR-RAS'!D614:E614,'PR-RAS'!D626:E626,'PR-RAS'!D628:E628,'PR-RAS'!D631:E631,'PR-RAS'!D634:E634,'PR-RAS'!D711:E711,'PR-RAS'!D728:E728,'PR-RAS'!D732:E732,'PR-RAS'!D734:E734)<>0),1,0)","v":0}]
[249,"O.K.","Obveznici razina 11 i 12 ne smiju imati popunjenu šifru 8332. Iznimka su obveznici s RKP-om 46237 na razini 11 i 47053 na razini 12.",null,0,0,{"$f":"IF(AND(OR(AND(I3=11,O3<>46237),AND(I3=12,O3<>47053)),MAX('PR-RAS'!D480:E480)>0),1,0)","v":0}]
[145,"O.K.","Obveznici razine 12 ne mogu imati popunjene šifre: 611 do 6117. Iznimka od tog pravila je obveznik s RKP-om 47123. Ako ova kontrola javlja pogrešku znači da je za obrazac razine 12 unesen iznos za neku od ovih šifri.",null,0,0,{"$f":"IF(AND(I3=12,O3<>47123,OR(MAX('PR-RAS'!D8:E15)>0,MIN('PR-RAS'!D8:E15)<0)),1,0)","v":0}]
[146,"O.K.","Obveznici razine 12 ne mogu imati popunjene šifre: 614 i 6148. Iznimka od ovog pravila su neki obveznici koji iznimno mogu, lista obveznika ugrađena je u kontrolu. Ako ova kontrola javlja pogrešku, znači da su ove šifre popunjene ali se ne radi o obvezniku koji ih može imati popunjene.",null,0,0,{"$f":"IF(AND(I3=12,MAX('PR-RAS'!D29:E29,'PR-RAS'!D36:E36)>0,O3<>51,O3<>47439,O3<>43214,O3<>47037,O3<>721,O3<>47053,O3<>756,O3<>1222,O3<>47107,O3<>47096,O3<>51409,O3<>51441),1,0)","v":0}]
[147,"O.K.","Razina 12 ne smije imati popunjene šifre: 6119 do 6135, 6141 do 6147, 615 do 6152, 6811, 367 do 3674. Ako je za bilo koju od ovih šifri upisan iznos, a obrazac je razine 12, kontrola javlja grešku i obrazac je neispravan. ",null,0,0,{"$f":"IF(AND(I3=12,MAX('PR-RAS'!D16:E28,'PR-RAS'!D30:E35,'PR-RAS'!D37:E39,'PR-RAS'!D141:E141,'PR-RAS'!D240:E243)>0),1,0)","v":0}]
[250,"O.K.","Obveznici razine 12 ne smiju imati popunjenu šifru 8121. Iznimka su obveznici s RKP-om 174, 713, 999, 1222, 20157, 40834, 47037 i 47061.",null,0,0,{"$f":"IF(AND(I3=12,O3<>174,O3<>713,O3<>999,O3<>1222,O3<>20157,O3<>40834,O3<>47037,O3<>47061,MAX('PR-RAS'!D428:E428)>0),1,0)","v":0}]
[148,"O.K.","Razina 12 ne smije imati popunjene šifre: 8122, 8172, 822 do 8222, 8232 do 8242, 8415, 8416, 8512, 8522, 8542, 511 do 5116, 5156 do 5158, 5165, 5166. Ako je za bilo koju od ovih šifri upisan iznos za razinu 12 obrazac je neispravan. ",null,0,0,{"$f":"IF(AND(I3=12,MAX('PR-RAS'!D429:E429,'PR-RAS'!D449:E449,'PR-RAS'!D463:E465,'PR-RAS'!D468:E471,'PR-RAS'!D488:E488,'PR-RAS'!D489:E489,'PR-RAS'!D518:E518,'PR-RAS'!D521:E521,'PR-RAS'!D527:E527,'PR-RAS'!D530:E534,'PR-RAS'!D547:E549,'PR-RAS'!D553:E554)>0),1,0)","v":0}]
[251,"O.K.","Obveznici razine 12 ne smiju imati popunjenu šifru 8413. Iznimka su obveznici s RKP-om 1087, 1222, 47061, 47107 i 51441.",null,0,0,{"$f":"IF(AND(I3=12,O3<>1087,O3<>1222,O3<>47061,O3<>47107,O3<>51441,MAX('PR-RAS'!D486:E486)>0),1,0)","v":0}]
[252,"O.K.","Obveznici razine 12 ne smiju imati popunjenu šifru 8414. Iznimka su obveznici s RKP-om 1079, 47053 i 47061.",null,0,0,{"$f":"IF(AND(I3=12,O3<>1079,O3<>47053,O3<>47061,MAX('PR-RAS'!D487:E487)>0),1,0)","v":0}]
[149,"O.K.","Razina 12 ne smije imati popunjene šifre: 5212, 5222, 524 do 5242, 5342, 551 do 5512, 5522, 5532, 34112, 34122, 34132, 34192. Ako je za bilo koju od ovih šifri upisan iznos, a obrazac je razine 12 obrazac je neispravan.",null,0,0,{"$f":"IF(AND(I3=12,MAX('PR-RAS'!D570:E570,'PR-RAS'!D573:E573,'PR-RAS'!D577:E579,'PR-RAS'!D592:E592,'PR-RAS'!D626:E628,'PR-RAS'!D631:E631,'PR-RAS'!D634:E634,'PR-RAS'!D728:E728,'PR-RAS'!D730:E730,'PR-RAS'!D732:E732,'PR-RAS'!D734:E734)>0),1,0)","v":0}]
[253,"O.K.","Obveznici razine 12 ne smiju imati popunjenu šifru 5332, osim obveznika s RKP-om 47053.",null,0,0,{"$f":"IF(AND(I3=12,O3<>47053,MAX('PR-RAS'!D589:E589)>0),1,0)","v":0}]
[254,"O.K.","Obveznici razine 12 ne smiju imati popunjene šifre 5414 do 5416, osim obveznika s RKP-om 174 i 1087.",null,0,0,{"$f":"IF(AND(I3=12,O3<>174,O3<>1087,MAX('PR-RAS'!D596:E598)>0),1,0)","v":0}]
[150,"O.K.","Razina 13 ne smije imati popunjene šifre: 671 do 6714. Ako je za bilo koju od ovih šifri upisan iznos, a obrazac je razine 13, kontrola javlja grešku i obrazac je neispravan.",null,0,0,{"$f":"IF(AND(I3=13,MAX('PR-RAS'!D134:E137)>0),1,0)","v":0}]
[151,"O.K.","Razina 21 ne smije imati popunjene šifre: 611 do 6152, 621 do 623, 6811, 3226, 3421, 367 do 3674 i 371 do 3715, 741 i 4228. Ako je za bilo koju od ovih šifri upisan iznos, a obrazac je razine 21 obrazac je neispravan.",null,0,0,{"$f":"IF(AND(I3=21,MAX('PR-RAS'!D8:E39,'PR-RAS'!D45:E49,'PR-RAS'!D141:E141,'PR-RAS'!D175:E175,'PR-RAS'!D203:E203,'PR-RAS'!D240:E243,'PR-RAS'!D253:E258,'PR-RAS'!D349:E349,'PR-RAS'!D377:E377)>0),1,0)","v":0}]
[152,"O.K.","Razina 21 ne smije imati popunjene šifre: 441, 811 do 8116, 8122, 8156 do 8158, 8165, 8166, 821 do 8212, 8222 do 8232, 8242, 8332, 8342, 841 do 8416. Ako je za bilo koju od ovih šifri upisan iznos, a obrazac je razine 21 obrazac je neispravan.",null,0,0,{"$f":"IF(AND(I3=21,MAX('PR-RAS'!D401:E401,'PR-RAS'!D422:E426,'PR-RAS'!D429:E429,'PR-RAS'!D439:E441,'PR-RAS'!D445:E446,'PR-RAS'!D460:E462,'PR-RAS'!D465:E468,'PR-RAS'!D471:E471,'PR-RAS'!D480:E480,'PR-RAS'!D483:E483,'PR-RAS'!D485:E489)>0),1,0)","v":0}]
[153,"O.K.","Razina 21 ne smije imati popunjene šifre: 8446 do 8448, 8455, 8456, 8512, 8522 do 8532, 8542, 511 do 5116, 5122, 5156 do 5158, 5165, 5166, 5212, 5222, 523 do 5242, 5332 i 5342. Ako je za bilo koju od ovih šifri upisan iznos za razinu 21 obrazac je neispravan.",null,0,0,{"$f":"IF(AND(I3=21,MAX('PR-RAS'!D499:E501,'PR-RAS'!D505:E506,'PR-RAS'!D518:E518,'PR-RAS'!D521:E524,'PR-RAS'!D527:E527,'PR-RAS'!D530:E534,'PR-RAS'!D537:E537,'PR-RAS'!D547:E549,'PR-RAS'!D553:E554,'PR-RAS'!D570:E570,'PR-RAS'!D573:E579,'PR-RAS'!D589:E589,'PR-RAS'!D592:E592)>0),1,0)","v":0}]
[154,"O.K.","Razina 21 ne smije imati popunjene šifre: 541 do 5416, 5446 do 5448, 5455, 5456, 551 do 5512, 5522, 5532, 65265, 34112, 34122, 34132, 34192. Ako je za bilo koju od ovih šifri upisan iznos za razinu 21, obrazac je neispravan.",null,0,0,{"$f":"IF(AND(I3=21,MAX('PR-RAS'!D594:E598,'PR-RAS'!D609:E611,'PR-RAS'!D615:E616,'PR-RAS'!D626:E628,'PR-RAS'!D631:E631,'PR-RAS'!D634:E634,'PR-RAS'!D711:E711,'PR-RAS'!D728:E728,'PR-RAS'!D730:E730,'PR-RAS'!D732:E732,'PR-RAS'!D734:E734)>0),1,0)","v":0}]
[255,"O.K.","Obveznici razina 21, 31, 41 i 42 ne mogu imati zaposlene u tijelima već samo kod korisnika. Ako ova kontrola javlja pogrešku znači da su zaposleni u stupcu tekuće ili prethodne godine upisani pod \"zaposlene u tijelima\" umjesto pod \"zaposlene kod korisnika\".",null,{"$f":"MAX(G191:K191)","v":0},{"$f":"MAX(L191:O191)","v":0},{"$f":"IF(AND(OR(I3=21,I3=31,I3=41,I3=42),MAX('PR-RAS'!D653:E653,'PR-RAS'!D655:E655)>0),1,0)","v":0}]
[256,"O.K.","Obveznici razine 22 mogu imati samo zaposlene u tijelima, a iznimno mogu imati popunjen i broj zaposlenih kod korisnika (zaposleni u vijećima nacionalnih manjina koji se iskazuju u razini 22). Ako obveznik razine 22 ima iskazan broj zaposlenih kod korisnika, kontrola javlja upozorenje. Ako obveznik razine 22 ima iskazan samo broj zaposlenih kod korisnika ili ako je broj zaposlenih kod korisnika veći od broja zaposlenih u tijelima, kontrola javlja pogrešku. Pod kontrolom su podaci u oba stupca.",null,0,0,{"$f":"IF(AND(I3=22,OR('PR-RAS'!D654>'PR-RAS'!D653,'PR-RAS'!E654>'PR-RAS'!E653,'PR-RAS'!D656>'PR-RAS'!D655,'PR-RAS'!E656>'PR-RAS'!E655)),1,0)","v":0},null,null,null,null,{"$f":"IF(AND(MAX('PR-RAS'!D654:E654,'PR-RAS'!D656:E656)>0,I3=22),1,0)","v":0}]
[155,"O.K.","Razine 22 ne smiju imati popunjene šifre: 612 do 6125, 6133, 6141, 6143, 615 do 6152, 621 do 623, 671 do 673, 6811, 3226, 371 do 3715. Ako je za bilo koju od ovih šifri upisan iznos, a obrazac je razine 22 obrazac je neispravan.",null,0,0,{"$f":"IF(AND(I3=22,MAX('PR-RAS'!D17:E22,'PR-RAS'!D26:E26,'PR-RAS'!D30:E30,'PR-RAS'!D32:E32,'PR-RAS'!D37:E39,'PR-RAS'!D45:E49,'PR-RAS'!D134:E138,'PR-RAS'!D141:E141,'PR-RAS'!D175:E175,'PR-RAS'!D253:E258)>0),1,0)","v":0}]
[156,"O.K.","Razine 22 ne smiju imati popunjene šifre: 741, 4228, 441, 811 do 8116, 8122, 8156 do 8158, 8165, 8166, 821 do 8212, 8222 do 8232, 8242, 8332, 8342. Ako je za bilo koju od ovih šifri upisan iznos, a obrazac je razine 22 obrazac je neispravan.",null,0,0,{"$f":"IF(AND(I3=22,MAX('PR-RAS'!D349:E349,'PR-RAS'!D377:E377,'PR-RAS'!D401:E401,'PR-RAS'!D422:E426,'PR-RAS'!D429:E429,'PR-RAS'!D439:E441,'PR-RAS'!D445:E446,'PR-RAS'!D460:E462,'PR-RAS'!D465:E468,'PR-RAS'!D471:E471,'PR-RAS'!D480:E480,'PR-RAS'!D483:E483)>0),1,0)","v":0}]
[157,"O.K.","Razine 22 ne smiju imati popunjene šifre: 8446 do 8448, 8455, 8456, 8512, 8522 do 8532, 8542, 511 do 5116, 5122, 5156 do 5158, 5165, 5166, 5212, 5222 do 5242, 5332, 5342. Ako je za bilo koju od ovih šifri upisan iznos, a obrazac je razine 22 obrazac je neispravan.",null,0,0,{"$f":"IF(AND(I3=22,MAX('PR-RAS'!D499:E501,'PR-RAS'!D505:E506,'PR-RAS'!D518:E518,'PR-RAS'!D521:E524,'PR-RAS'!D527:E527,'PR-RAS'!D530:E534,'PR-RAS'!D537:E537,'PR-RAS'!D547:E549,'PR-RAS'!D553:E554,'PR-RAS'!D570:E570,'PR-RAS'!D573:E579,'PR-RAS'!D589:E589,'PR-RAS'!D592:E592)>0),1,0)","v":0}]
[158,"O.K.","Razine 22 ne smiju imati popunjene šifre: 5446 do 5448, 5455, 5456, 551 do 5512, 5522, 5532, 65265, 34112, 34132, 34192. Ako je za bilo koju od ovih šifri upisan iznos, a obrazac je razine 22 obrazac je neispravan.",null,0,0,{"$f":"IF(AND(I3=22,MAX('PR-RAS'!D609:E611,'PR-RAS'!D615:E615,'PR-RAS'!D616:E616,'PR-RAS'!D626:E628,'PR-RAS'!D631:E631,'PR-RAS'!D634:E634,'PR-RAS'!D711:E711,'PR-RAS'!D728:E728,'PR-RAS'!D732:E732,'PR-RAS'!D734:E734)>0),1,0)","v":0}]
[159,"O.K.","Razine 23 ne smiju imati popunjene šifre: 612 do 6125, 6133, 6141, 6143, 615 do 6152, 621 do 623, 639 do 6394, 671 do 6714, 6811, 3226, 367 do 3674, 369 do 3694, 371 do 3715, 741, 4228 i 441. Ako je bilo koja od ovih šifri popunjena obrazac je neispravan.",null,0,0,{"$f":"IF(AND(I3=23,MAX('PR-RAS'!D17:E22,'PR-RAS'!D26:E26,'PR-RAS'!D30:E30,'PR-RAS'!D32:E32,'PR-RAS'!D37:E39,'PR-RAS'!D45:E49,'PR-RAS'!D77:E81,'PR-RAS'!D134:E137,'PR-RAS'!D175:E175,'PR-RAS'!D240:E243,'PR-RAS'!D247:E251,'PR-RAS'!D253:E258,'PR-RAS'!D349:E349,'PR-RAS'!D377:E377,'PR-RAS'!D401:E401)>0),1,0)","v":0}]
[160,"O.K.","Razine 23 ne smiju imati popunjene šifre: 811 do 8116, 8122, 8156 do 8158, 8165, 8166, 821 do 8212, 8222 do 8232, 8242, 8332, 8342, 8446 do 8448, 8455 i 8456. Ako je za bilo koju od ovih šifri upisan iznos za razinu 23 obrazac je neispravan.",null,0,0,{"$f":"IF(AND(I3=23,MAX('PR-RAS'!D422:E426,'PR-RAS'!D429:E429,'PR-RAS'!D439:E441,'PR-RAS'!D445:E446,'PR-RAS'!D460:E462,'PR-RAS'!D465:E468,'PR-RAS'!D471:E471,'PR-RAS'!D480:E480,'PR-RAS'!D483:E483,'PR-RAS'!D499:E501,'PR-RAS'!D505:E506)>0),1,0)","v":0}]
[161,"O.K.","Razine 23 ne smiju imati popunjene šifre: 8512, 8522 do 8532, 8542, 511 do 5116, 5122, 5156 do 5158, 5165, 5166, 5212, 5222 do 5242, 5332, 5342. Ako je za bilo koju od ovih šifri upisan iznos za razinu 23 obrazac je neispravan.",null,0,0,{"$f":"IF(AND(I3=23,MAX('PR-RAS'!D518:E518,'PR-RAS'!D521:E524,'PR-RAS'!D527:E527,'PR-RAS'!D530:E534,'PR-RAS'!D537:E537,'PR-RAS'!D547:E549,'PR-RAS'!D553:E554,'PR-RAS'!D570:E570,'PR-RAS'!D573:E579,'PR-RAS'!D589:E589,'PR-RAS'!D592:E592)>0),1,0)","v":0}]
[162,"O.K.","Razine 23 ne smiju imati popunjene šifre: 5446 do 5448, 5455, 5456, 551 do 5512, 5522, 5532, 65265, 34112, 34122, 34132, 34192. Ako je za bilo koju od ovih šifri upisan iznos za razinu 23 obrazac je neispravan.",null,0,0,{"$f":"IF(AND(I3=23,MAX('PR-RAS'!D609:E611,'PR-RAS'!D615:E616,'PR-RAS'!D626:E628,'PR-RAS'!D631:E631,'PR-RAS'!D634:E634,'PR-RAS'!D711:E711,'PR-RAS'!D728:E728,'PR-RAS'!D730:E730,'PR-RAS'!D732:E732,'PR-RAS'!D734:E734)>0),1,0)","v":0}]
[163,"O.K.","Razina 31 ne smije imati popunjene šifre: 611 do 6152, 621 do 623, 6811, 3226, 3421, 367 do 3674, 371 do 3715, 741, 4228, 441. Ako je za bilo koju od ovih šifri upisan iznos za razinu 31 obrazac je neispravan.",null,0,0,{"$f":"IF(AND(I3=31,MAX('PR-RAS'!D8:E39,'PR-RAS'!D45:E49,'PR-RAS'!D141:E141,'PR-RAS'!D175:E175,'PR-RAS'!D203:E203,'PR-RAS'!D240:E243,'PR-RAS'!D253:E258,'PR-RAS'!D349:E349,'PR-RAS'!D377:E377,'PR-RAS'!D401:E401)>0),1,0)","v":0}]
[164,"O.K.","Razina 31 ne smije imati popunjene šifre: 811 do 8116, 8122, 8156 do 8158, 8165, 8166, 821 do 8212, 8222 do 8232, 8242, 8342, 841 do 8416, 8446 do 8448, 8455, 8456. Ako je za bilo koju od ovih šifri upisan iznos za razinu 31 obrazac je neispravan.",null,0,0,{"$f":"IF(AND(I3=31,MAX('PR-RAS'!D422:E426,'PR-RAS'!D429:E429,'PR-RAS'!D439:E441,'PR-RAS'!D445:E446,'PR-RAS'!D460:E462,'PR-RAS'!D465:E468,'PR-RAS'!D471:E471,'PR-RAS'!D483:E483,'PR-RAS'!D485:E489,'PR-RAS'!D499:E501,'PR-RAS'!D505:E506)>0),1,0)","v":0}]
[165,"O.K.","Razina 31 ne smije imati popunjene šifre: 8512, 8522 do 8532, 8542, 511 do 5116, 5122, 5156 do 5158, 5165, 5166, 5212, 5222 do 5242, 5332, 5342, 541 do 5416. Ako je za bilo koju od ovih šifri upisan iznos za razinu 31 obrazac je neispravan.",null,0,0,{"$f":"IF(AND(I3=31,MAX('PR-RAS'!D518:E518,'PR-RAS'!D521:E524,'PR-RAS'!D527:E527,'PR-RAS'!D530:E534,'PR-RAS'!D537:E537,'PR-RAS'!D547:E549,'PR-RAS'!D553:E554,'PR-RAS'!D570:E570,'PR-RAS'!D573:E579,'PR-RAS'!D589:E589,'PR-RAS'!D592:E592,'PR-RAS'!D594:E598)>0),1,0)","v":0}]
[166,"O.K.","Razina 31 ne smije imati popunjene šifre: 5455, 5456, 551 do 5512, 5522, 5532, Z006, Z008, 65265, 34112, 34122, 34132, 34192. Ako je za bilo koju od ovih šifri upisan iznos za razinu 31 obrazac je neispravan.",null,0,0,{"$f":"IF(AND(I3=31,MAX('PR-RAS'!D615:E616,'PR-RAS'!D626:E628,'PR-RAS'!D631:E631,'PR-RAS'!D634:E634,'PR-RAS'!D653:E653,'PR-RAS'!D655:E655,'PR-RAS'!D711:E711,'PR-RAS'!D728:E728,'PR-RAS'!D730:E730,'PR-RAS'!D732:E732,'PR-RAS'!D734:E734)>0),1,0)","v":0}]
[167,"O.K.","Obveznici razine 41 ne smiju imati popunjene šifre: 671 do 6714. Iznimka od tog pravila su obveznici s RKP-om 23911 i 25843. Ako ova kontrola javlja pogrešku znači da je za obrazac razine 41 unesen iznos za neku od ovih šifri.",null,0,0,{"$f":"IF(AND(I3=41,O3<>23911,O3<>25843,MAX('PR-RAS'!D134:E137)>0),1,0)","v":0}]
[168,{"$f":"IF(E206=1,\"Pogreška\",IF(F206=1,\"Provjera\",\"O.K.\"))","v":"O.K."},"Razina 41 ne smije imati popunjene šifre: 611 do 6152, 673, 6811, 3226, 741, 441, 811 do 8116, 8122, 8156 do 8158, 8165, 8166, 821 do 8212, 8222 do 8232, 8414 do 8416. Ako je za bilo koju od ovih šifri upisan iznos za razinu 41 obrazac je neispravan.",null,0,0,{"$f":"IF(AND(I3=41,MAX('PR-RAS'!D8:E39,'PR-RAS'!D138:E138,'PR-RAS'!D141:E141,'PR-RAS'!D175:E175,'PR-RAS'!D349:E349,'PR-RAS'!D401:E401,'PR-RAS'!D422:E426,'PR-RAS'!D429:E429,'PR-RAS'!D439:E441,'PR-RAS'!D445:E445,'PR-RAS'!D446:E446,'PR-RAS'!D460:E462,'PR-RAS'!D465:E468,'PR-RAS'!D487:E489)>0),1,0)","v":0}]
[169,"O.K.","Razina 41 ne smije imati popunjene šifre: 8512, 8522 do 8532, 8542, 511 do 5116, 5122, 5156 do 5158, 5165, 5166, 5212, 5222 do 5242, 5332, 5342, 5414 do 5416. Ako je za bilo koju od ovih šifri upisan iznos za razinu 41 obrazac je neispravan.",null,0,0,{"$f":"IF(AND(I3=41,MAX('PR-RAS'!D518:E518,'PR-RAS'!D521:E524,'PR-RAS'!D527:E527,'PR-RAS'!D530:E534,'PR-RAS'!D537:E537,'PR-RAS'!D547:E549,'PR-RAS'!D553:E554,'PR-RAS'!D570:E570,'PR-RAS'!D573:E579,'PR-RAS'!D589:E589,'PR-RAS'!D592:E592,'PR-RAS'!D596:E598)>0),1,0)","v":0}]
[170,"O.K.","Razina 41 ne smije imati popunjene šifre: 551 do 5512, 5522, 5532, Z006, Z008, 34112, 34122, 34132, 34192. Ako je za bilo koju od ovih šifri upisan iznos za razinu 41 obrazac je neispravan.",null,0,0,{"$f":"IF(AND(I3=41,MAX('PR-RAS'!D626:E628,'PR-RAS'!D631:E631,'PR-RAS'!D634:E634,'PR-RAS'!D653:E653,'PR-RAS'!D655:E655,'PR-RAS'!D728:E728,'PR-RAS'!D730:E730,'PR-RAS'!D732:E732,'PR-RAS'!D734:E734)>0),1,0)","v":0}]
[171,{"$f":"IF(E209=1,\"Pogreška\",IF(F209=1,\"Provjera\",\"O.K.\"))","v":"O.K."},"Razina 42 ne smije imati popunjene šifre: 611 do 6152, 621 do 623, 671 do 673, 6811, 3226, 361 do 3622, 371 do 3715, 741 i 441. Ako je za bilo koju od ovih šifri upisan iznos za razinu 42 obrazac je neispravan.",null,0,0,{"$f":"IF(AND(I3=42,MAX('PR-RAS'!D8:E39,'PR-RAS'!D45:E49,'PR-RAS'!D134:E138,'PR-RAS'!D141:E141,'PR-RAS'!D175:E175,'PR-RAS'!D225:E230,'PR-RAS'!D253:E258,'PR-RAS'!D349:E349,'PR-RAS'!D401:E401)>0),1,0)","v":0}]
[172,"O.K.","Razina 42 ne smije imati popunjene šifre: 811 do 8116, 8122, 8156 do 8158, 8165, 8166, 821 do 8212, 8222 do 8232, 8242, 8332, 8342, 841 do 8416, 8512, 8522 do 8532. Ako je za bilo koju od ovih šifri upisan iznos za razinu 42 obrazac je neispravan.",null,0,0,{"$f":"IF(AND(I3=42,MAX('PR-RAS'!D422:E426,'PR-RAS'!D429:E429,'PR-RAS'!D439:E441,'PR-RAS'!D445:E446,'PR-RAS'!D460:E462,'PR-RAS'!D465:E468,'PR-RAS'!D471:E471,'PR-RAS'!D480:E480,'PR-RAS'!D483:E483,'PR-RAS'!D485:E489,'PR-RAS'!D518:E518,'PR-RAS'!D521:E524)>0),1,0)","v":0}]
[173,"O.K.","Razina 42 ne smije imati popunjene šifre: 8542, 511 do 5116, 5122, 5156 do 5158, 5165, 5166, 5212, 5222 do 5242, 5332, 5342, 5414 do 5416. Ako je za bilo koju od ovih šifri upisan iznos za razinu 42 obrazac je neispravan.",null,0,0,{"$f":"IF(AND(I3=42,MAX('PR-RAS'!D527:E527,'PR-RAS'!D530:E534,'PR-RAS'!D537:E537,'PR-RAS'!D547:E549,'PR-RAS'!D553:E554,'PR-RAS'!D570:E570,'PR-RAS'!D573:E579,'PR-RAS'!D589:E589,'PR-RAS'!D592:E592,'PR-RAS'!D596:E598)>0),1,0)","v":0}]
[174,"O.K.","Razina 42 ne smije imati popunjene šifre: 551 do 5512, 5522, 5532, Z006, Z008, 65265, 34112, 34122, 34132, 34192. Ako je za bilo koju od ovih šifri upisan iznos za razinu 42 obrazac je neispravan.",null,0,0,{"$f":"IF(AND(I3=42,MAX('PR-RAS'!D626:E628,'PR-RAS'!D631:E631,'PR-RAS'!D634:E634,'PR-RAS'!D653:E653,'PR-RAS'!D655:E655,'PR-RAS'!D711:E711,'PR-RAS'!D728:E728,'PR-RAS'!D730:E730,'PR-RAS'!D732:E732,'PR-RAS'!D734:E734)>0),1,0)","v":0}]
[175,"O.K.","Kod razine 11 korisnici mogu imati popunjen samo broj zaposlenih kod korisnika (šifra Z007 i Z009), a glave unutar nadležnog ministarstva mogu imati popunjene samo zaposlene u tijelima (šifra Z006 i Z008). Ova kontrola upozorava kada su istovremeno popunjene šifre Z006 i Z007 ili Z008 i Z009 (broj zaposlenih u tijelima i kod korisnika), što mogu imati popunjene samo glave unutar nadležnog ministarstva / razdjela koja imaju iskazane i rashode proračunskih korisnika iz svoje nadležnosti.",null,{"$f":"MAX(G213:K213)","v":0},0,null,null,null,null,null,{"$f":"IF(AND(I3=11,OR(AND('PR-RAS'!D653<>0,'PR-RAS'!D654<>0),AND('PR-RAS'!D655<>0,'PR-RAS'!D656<>0))),1,0)","v":0},{"$f":"IF(AND(I3=11,OR(AND('PR-RAS'!E653<>0,'PR-RAS'!E654<>0),AND('PR-RAS'!E655<>0,'PR-RAS'!E656<>0))),1,0)","v":0}]
[176,"O.K.","Ako je iznos za šifru 6131 veći od nule, a iznos za šifru 61315 (porez na korištenje javnih površina) je jednak nuli, provjerite šifru 61315. Ako je njezin iznos stvarno toliki, zanemarite ovu kontrolu.",null,0,{"$f":"MAX(L214:O214)","v":0},null,null,null,null,null,{"$f":"IF(AND('PR-RAS'!D24>0,'PR-RAS'!D658=0),1,0)","v":0},{"$f":"IF(AND('PR-RAS'!E24>0,'PR-RAS'!E658=0),1,0)","v":0}]
[177,"O.K.","Ako je iznos za šifru 6145 veći od nule, a iznosi za šifre 61451 (porez na cestovna motorna vozila) i 61453 (porez na tvrtku odnosno naziv tvrtke) su jednaki nuli, provjerite šifre 61451 i 61453. Ako su njihovi iznosi stvarno toliki, zanemarite ovu kontrolu.",null,0,0,null,null,null,null,null,{"$f":"IF(AND('PR-RAS'!D33>0,SUM('PR-RAS'!D659:'PR-RAS'!D660)=0),1,0)","v":0},{"$f":"IF(AND('PR-RAS'!E33>0,SUM('PR-RAS'!E659:'PR-RAS'!E660)=0),1,0)","v":0}]
[178,"O.K.","Ako je iznos za šifru 6419 veći od nule, a iznos za šifru 64191 (premije na izdane vrijednosne papire) je jednak nuli, provjerite šifru 64191. Ako je njezin iznos stvarno toliki, zanemarite ovu kontrolu.",null,0,0,null,null,null,null,null,{"$f":"IF(AND('PR-RAS'!D90>0,'PR-RAS'!D702=0),1,0)","v":0},{"$f":"IF(AND('PR-RAS'!E90>0,'PR-RAS'!E702=0),1,0)","v":0}]
[179,"O.K.","Ako je iznos za šifru 6526 veći od nule, a iznosi za šifre 65264 (sufinanciranje cijene usluge, participacije i slično), 65265 (dopunsko zdravstveno osiguranje) i 65267 (prihodi s naslova osiguranja, refundacije štete i totalne štete) su jednaki nuli, provjerite šifre 65264, 65265 i 65267. Ako su njihovi iznosi stvarno toliki, zanemarite ovu kontrolu.",null,0,0,null,null,null,null,null,{"$f":"IF(AND('PR-RAS'!D117>0,SUM('PR-RAS'!D710:'PR-RAS'!D712)=0),1,0)","v":0},{"$f":"IF(AND('PR-RAS'!E117>0,SUM('PR-RAS'!E710:'PR-RAS'!E712)=0),1,0)","v":0}]
[180,"Provjera","Ako je iznos za šifru 312 veći od nule, a iznosi za šifre 31214 (otpremnine) i 31215 (naknade za bolest, invalidnost i smrtni slučaj) su jednaki nuli, provjerite šifre 31214 i 31215. Ako su njihovi iznosi stvarno toliki, zanemarite ovu kontrolu.",null,0,1,null,null,null,null,null,{"$f":"IF(AND('PR-RAS'!D158>0,SUM('PR-RAS'!D716:D717)=0),1,0)","v":0},{"$f":"IF(AND('PR-RAS'!E158>0,SUM('PR-RAS'!E716:E717)=0),1,0)","v":1}]
[181,"O.K.","Ako je iznos za šifru 3236 veći od nule, a iznos za šifru 32361 (obvezni i preventivni zdravstveni pregledi zaposlenika) je jednak nuli, provjerite šifru 32361. Ako je njezin iznos stvarno toliki, zanemarite ovu kontrolu.",null,0,0,null,null,null,null,null,{"$f":"IF(AND('PR-RAS'!D183>0,'PR-RAS'!D720=0),1,0)","v":0},{"$f":"IF(AND('PR-RAS'!E183>0,'PR-RAS'!E720=0),1,0)","v":0}]
[182,"O.K.","Ako je iznos za šifru 3237 veći od nule, a iznosi za šifre 32371 (autorski honorari), 32372 (ugovori o djelu) i 32377 (usluge agencija, studentskog servisa (prijepisi, prijevodi i drugo)) su jednaki nuli, provjerite šifre 32371, 32372 i 32377. Ako su njihovi iznosi stvarno toliki, zanemarite ovu kontrolu.",null,0,0,null,null,null,null,null,{"$f":"IF(AND('PR-RAS'!D184>0,SUM('PR-RAS'!D721:D723)=0),1,0)","v":0},{"$f":"IF(AND('PR-RAS'!E184>0,SUM('PR-RAS'!E721:E723)=0),1,0)","v":0}]
[183,"Provjera","Ako je iznos za šifru 3239 veći od nule, a iznos za šifru 32398 (naknada za energetsku uslugu) je jednak nuli, provjerite šifru 32398. Ako je njezin iznos stvarno toliki, zanemarite ovu kontrolu.",null,0,1,null,null,null,null,null,{"$f":"IF(AND('PR-RAS'!D186>0,'PR-RAS'!D724=0),1,0)","v":1},{"$f":"IF(AND('PR-RAS'!E186>0,'PR-RAS'!E724=0),1,0)","v":1}]
[184,"O.K.","Ako je iznos za šifru 3291 veći od nule, a iznos za šifru 32911 (naknade članovima predstavničkih i izvršnih tijela i upravnih vijeća) je jednak nuli, provjerite šifru 32911. Ako je njezin iznos stvarno toliki, zanemarite ovu kontrolu.",null,0,0,null,null,null,null,null,{"$f":"IF(AND('PR-RAS'!D189>0,'PR-RAS'!D725=0),1,0)","v":0},{"$f":"IF(AND('PR-RAS'!E189>0,'PR-RAS'!E725=0),1,0)","v":0}]
[185,"O.K.","Ako je iznos za šifru 3292 veći od nule, a iznos za šifru 32923 (premije osiguranja zaposlenih) je jednak nuli, provjerite šifru 32923. Ako je njezin iznos stvarno toliki, zanemarite ovu kontrolu.",null,0,0,null,null,null,null,null,{"$f":"IF(AND('PR-RAS'!D190>0,'PR-RAS'!D726=0),1,0)","v":0},{"$f":"IF(AND('PR-RAS'!E190>0,'PR-RAS'!E726=0),1,0)","v":0}]
[186,"O.K.","Ako je iznos za šifru 3427 veći od nule, a iznosi za šifre 34273 (kamate za primljene zajmove od tuzemnih trgovačkih društava izvan javnog sektora), 34274 (kamate za primljene zajmove od tuzemnih obrtnika) i 34275 (kamate za primljene zajmove od inozemnih trgovačkih društava) su jednaki nuli, provjerite šifre 34273 do 34275. Ako su njihovi iznosi stvarno toliki, zanemarite kontrolu.",null,0,0,null,null,null,null,null,{"$f":"IF(AND('PR-RAS'!D208>0,SUM('PR-RAS'!D748:D750)=0),1,0)","v":0},{"$f":"IF(AND('PR-RAS'!E208>0,SUM('PR-RAS'!E748:E750)=0),1,0)","v":0}]
[187,"O.K.","Ako je iznos za šifru 3434 veći od nule, a iznos za šifru 34341 (diskont na izdane vrijednosne papire) je jednak nuli, provjerite šifru 34341. Ako je njezin iznos stvarno toliki, zanemarite ovu kontrolu.",null,0,0,null,null,null,null,null,{"$f":"IF(AND('PR-RAS'!D214>0,'PR-RAS'!D758=0),1,0)","v":0},{"$f":"IF(AND('PR-RAS'!E214>0,'PR-RAS'!E758=0),1,0)","v":0}]
[189,"O.K.","Ako je iznos za šifru 3811 veći od nule, a iznos za šifru 38117 (tekuće donacije građanima i kućanstvima) je jednak nuli, provjerite šifru 38117. Ako je njezin iznos stvarno toliki, zanemarite ovu kontrolu.",null,0,0,null,null,null,null,null,{"$f":"IF(AND('PR-RAS'!D265>0,'PR-RAS'!D829=0),1,0)","v":0},{"$f":"IF(AND('PR-RAS'!E265>0,'PR-RAS'!E829=0),1,0)","v":0}]
[190,"O.K.","Ako je iznos za šifru 8121 veći od nule, a iznos za šifru 81212 jednak nuli, provjerite šifru 81212. Ako je njezin iznos stvarno toliki, zanemarite ovu kontrolu.",null,0,0,null,null,null,null,null,{"$f":"IF(AND('PR-RAS'!D428>0,SUM('PR-RAS'!D846:D846)=0),1,0)","v":0},{"$f":"IF(AND('PR-RAS'!E428>0,SUM('PR-RAS'!E846:E846)=0),1,0)","v":0}]
[191,"O.K.","Ako je iznos za šifru 8132 veći od nule, a iznos za šifru 81322 jednak nuli, provjerite šifru 81322. Ako je njezin iznos stvarno toliki, zanemarite ovu kontrolu.",null,0,0,null,null,null,null,null,{"$f":"IF(AND('PR-RAS'!D431>0,SUM('PR-RAS'!D847:D847)=0),1,0)","v":0},{"$f":"IF(AND('PR-RAS'!E431>0,SUM('PR-RAS'!E847:E847)=0),1,0)","v":0}]
[192,"O.K.","Ako je iznos za šifru 8133 veći od nule, a iznos za šifru 81332 jednak nuli, provjerite šifru 81332. Ako je njezin iznos stvarno toliki, zanemarite ovu kontrolu.",null,0,0,null,null,null,null,null,{"$f":"IF(AND('PR-RAS'!D432>0,SUM('PR-RAS'!D848:D848)=0),1,0)","v":0},{"$f":"IF(AND('PR-RAS'!E432>0,SUM('PR-RAS'!E848:E848)=0),1,0)","v":0}]
[193,"O.K.","Ako je iznos za šifru 8134 veći od nule, a iznos za šifru 81342 jednak nuli, provjerite šifru 81342. Ako je njezin iznos stvarno toliki, zanemarite ovu kontrolu.",null,0,0,null,null,null,null,null,{"$f":"IF(AND('PR-RAS'!D433>0,SUM('PR-RAS'!D849:D849)=0),1,0)","v":0},{"$f":"IF(AND('PR-RAS'!E433>0,SUM('PR-RAS'!E849:E849)=0),1,0)","v":0}]
[194,"O.K.","Ako je iznos za šifru 8153 veći od nule, a iznos za šifru 81532 jednak nuli, provjerite šifru 81532. Ako je njezin iznos stvarno toliki, zanemarite ovu kontrolu.",null,0,0,null,null,null,null,null,{"$f":"IF(AND('PR-RAS'!D436>0,SUM('PR-RAS'!D852:D852)=0),1,0)","v":0},{"$f":"IF(AND('PR-RAS'!E436>0,SUM('PR-RAS'!E852:E852)=0),1,0)","v":0}]
[195,"O.K.","Ako je iznos za šifru 8154 veći od nule, a iznos za šifru 81542 jednak nuli, provjerite šifru 81542. Ako je njezin iznos stvarno toliki, zanemarite ovu kontrolu.",null,0,0,null,null,null,null,null,{"$f":"IF(AND('PR-RAS'!D437>0,SUM('PR-RAS'!D853:D853)=0),1,0)","v":0},{"$f":"IF(AND('PR-RAS'!E437>0,SUM('PR-RAS'!E853:E853)=0),1,0)","v":0}]
[196,"O.K.","Ako je iznos za šifru 8155 veći od nule, a iznos za šifru 81552 jednak nuli, provjerite šifru 81552. Ako je njezin iznos stvarno toliki, zanemarite ovu kontrolu.",null,0,0,null,null,null,null,null,{"$f":"IF(AND('PR-RAS'!D438>0,SUM('PR-RAS'!D854:D854)=0),1,0)","v":0},{"$f":"IF(AND('PR-RAS'!E438>0,SUM('PR-RAS'!E854:E854)=0),1,0)","v":0}]
[197,"O.K.","Ako je iznos za šifru 8241 veći od nule, a iznos za šifru 82412 (ostali vrijednosni papiri - dugoročni) je jednak nuli, provjerite šifru 82412. Ako je njezin iznos stvarno toliki, zanemarite ovu kontrolu.",null,0,0,null,null,null,null,null,{"$f":"IF(AND('PR-RAS'!D470>0,'PR-RAS'!D873=0),1,0)","v":0},{"$f":"IF(AND('PR-RAS'!E470>0,'PR-RAS'!E873=0),1,0)","v":0}]
[198,"O.K.","Ako je iznos za šifru 8413 veći od nule, a iznos za šifru 84132 (primljeni zajmovi od međunarodnih organizacija - dugoročni) je jednak nuli, provjerite šifru 84132. Ako je njezin iznos stvarno toliki, zanemarite ovu kontrolu.",null,0,0,null,null,null,null,null,{"$f":"IF(AND('PR-RAS'!D486>0,'PR-RAS'!D874=0),1,0)","v":0},{"$f":"IF(AND('PR-RAS'!E486>0,'PR-RAS'!E874=0),1,0)","v":0}]
[199,"O.K.","Ako je iznos za šifru 8414 veći od nule, a iznos za šifru 84142 (primljeni krediti i zajmovi od institucija i tijela EU - dugoročni) je jednak nuli, provjerite šifru 84142. Ako je njezin iznos stvarno toliki, zanemarite ovu kontrolu.",null,0,0,null,null,null,null,null,{"$f":"IF(AND('PR-RAS'!D487>0,'PR-RAS'!D875=0),1,0)","v":0},{"$f":"IF(AND('PR-RAS'!E487>0,'PR-RAS'!E875=0),1,0)","v":0}]
[200,"O.K.","Ako je iznos za šifru 8415 veći od nule, a iznos za šifru 84152 (primljeni zajmovi od inozemnih vlada u EU - dugoročni) je jednak nuli, provjerite šifru 84152. Ako je njezin iznos stvarno toliki, zanemarite ovu kontrolu.",null,0,0,null,null,null,null,null,{"$f":"IF(AND('PR-RAS'!D488>0,'PR-RAS'!D876=0),1,0)","v":0},{"$f":"IF(AND('PR-RAS'!E488>0,'PR-RAS'!E876=0),1,0)","v":0}]
[201,"O.K.","Ako je iznos za šifru 8416 veći od nule, a iznos za šifru 84162 (primljeni zajmovi od inozemnih vlada izvan EU - dugoročni) je jednak nuli, provjerite šifru 84162. Ako je njezin iznos stvarno toliki, zanemarite ovu kontrolu.",null,0,0,null,null,null,null,null,{"$f":"IF(AND('PR-RAS'!D489>0,'PR-RAS'!D877=0),1,0)","v":0},{"$f":"IF(AND('PR-RAS'!E489>0,'PR-RAS'!E877=0),1,0)","v":0}]
[202,"O.K.","Ako je iznos za šifru 8423 veći od nule, a iznos za šifru 84232 (primljeni zajmovi od osiguravajućih društava u javnom sektoru - dugoročni) je jednak nuli, provjerite šifru 84232. Ako je njezin iznos stvarno toliki, zanemarite ovu kontrolu.",null,0,0,null,null,null,null,null,{"$f":"IF(AND('PR-RAS'!D492>0,'PR-RAS'!D881=0),1,0)","v":0},{"$f":"IF(AND('PR-RAS'!E492>0,'PR-RAS'!E881=0),1,0)","v":0}]
[203,"O.K.","Ako je iznos za šifru 8424 veći od nule, a iznos za šifre 84242 i 84243 jednaki nuli, provjerite šifre 84242 i 84243. Ako je njihov iznos stvarno toliki, zanemarite ovu kontrolu.",null,0,0,null,null,null,null,null,{"$f":"IF(AND('PR-RAS'!D493>0,SUM('PR-RAS'!D882:D883)=0),1,0)","v":0},{"$f":"IF(AND('PR-RAS'!E493>0,SUM('PR-RAS'!E882:E883)=0),1,0)","v":0}]
[204,"O.K.","Ako je iznos za šifru 843 veći od nule, a iznos za šifru 84312 (primljeni zajmovi od trgovačkih društava u javnom sektoru - dugoročni) je jednak nuli, provjerite šifru 84312. Ako je njezin iznos stvarno toliki, zanemarite ovu kontrolu.",null,0,0,null,null,null,null,null,{"$f":"IF(AND('PR-RAS'!D494>0,'PR-RAS'!D884=0),1,0)","v":0},{"$f":"IF(AND('PR-RAS'!E494>0,'PR-RAS'!E884=0),1,0)","v":0}]
[205,"O.K.","Ako je iznos za šifru 8444 veći od nule, a iznos za šifru 84442 (primljeni zajmovi od tuzemnih osiguravajućih društava izvan javnog sektora - dugoročni) je jednak nuli, provjerite šifru 84442. Ako je njezin iznos stvarno toliki, zanemarite ovu kontrolu.",null,0,0,null,null,null,null,null,{"$f":"IF(AND('PR-RAS'!D497>0,'PR-RAS'!D888=0),1,0)","v":0},{"$f":"IF(AND('PR-RAS'!E497>0,'PR-RAS'!E888=0),1,0)","v":0}]
[206,"O.K.","Ako je iznos za šifru 8445 veći od nule, a iznos za šifre 84452 i 84453 jednaki nuli, provjerite šifre 84452 i 84453. Ako je njihov iznos stvarno toliki, zanemarite ovu kontrolu.",null,0,0,null,null,null,null,null,{"$f":"IF(AND('PR-RAS'!D498>0,SUM('PR-RAS'!D889:D890)=0),1,0)","v":0},{"$f":"IF(AND('PR-RAS'!E498>0,SUM('PR-RAS'!E889:E890)=0),1,0)","v":0}]
[207,"O.K.","Ako je iznos za šifru 8447 veći od nule, a iznos za šifru 84472 (primljeni zajmovi od inozemnih osiguravajućih društava - dugoročni) je jednak nuli, provjerite šifru 84472. Ako je njezin iznos stvarno toliki, zanemarite ovu kontrolu.",null,0,0,null,null,null,null,null,{"$f":"IF(AND('PR-RAS'!D500>0,'PR-RAS'!D894=0),1,0)","v":0},{"$f":"IF(AND('PR-RAS'!E500>0,'PR-RAS'!E894=0),1,0)","v":0}]
[208,"O.K.","Ako je iznos za šifru 8448 veći od nule, a iznos za šifre 84482 i 84483 jednaki nuli, provjerite šifre 84482 i 84483. Ako je njihov iznos stvarno toliki, zanemarite ovu kontrolu.",null,0,0,null,null,null,null,null,{"$f":"IF(AND('PR-RAS'!D501>0,SUM('PR-RAS'!D895:D896)=0),1,0)","v":0},{"$f":"IF(AND('PR-RAS'!E501>0,SUM('PR-RAS'!E895:E896)=0),1,0)","v":0}]
[209,"O.K.","Ako je iznos za šifru 8453 veći od nule, a iznos za šifru 84532 (primljeni zajmovi od tuzemnih trgovačkih društava izvan javnog sektora - dugoročni) je jednak nuli, provjerite šifru 84532. Ako je njezin iznos stvarno toliki, zanemarite ovu kontrolu.",null,0,0,null,null,null,null,null,{"$f":"IF(AND('PR-RAS'!D503>0,'PR-RAS'!D897=0),1,0)","v":0},{"$f":"IF(AND('PR-RAS'!E503>0,'PR-RAS'!E897=0),1,0)","v":0}]
[210,"O.K.","Ako je iznos za šifru 8454 veći od nule, a iznos za šifru 84542 (primljeni zajmovi od tuzemnih obrtnika - dugoročni) je jednak nuli, provjerite šifru 84542. Ako je njezin iznos stvarno toliki, zanemarite ovu kontrolu.",null,0,0,null,null,null,null,null,{"$f":"IF(AND('PR-RAS'!D504>0,'PR-RAS'!D898=0),1,0)","v":0},{"$f":"IF(AND('PR-RAS'!E504>0,'PR-RAS'!E898=0),1,0)","v":0}]
[211,"O.K.","Ako je iznos za šifru 8455 veći od nule, a iznos za šifru 84552 (primljeni zajmovi od inozemnih trgovačkih društava - dugoročni) je jednak nuli, provjerite šifru 84552. Ako je njezin iznos stvarno toliki, zanemarite ovu kontrolu.",null,0,0,null,null,null,null,null,{"$f":"IF(AND('PR-RAS'!D505>0,'PR-RAS'!D899=0),1,0)","v":0},{"$f":"IF(AND('PR-RAS'!E505>0,'PR-RAS'!E899=0),1,0)","v":0}]
[212,"O.K.","Ako je iznos za šifru 8541 veći od nule, a iznos za šifru 85412 (ostali tuzemni vrijednosni papiri - dugoročni) je jednak nuli, provjerite šifru 85412. Ako je njezin iznos stvarno toliki, zanemarite ovu kontrolu.",null,0,0,null,null,null,null,null,{"$f":"IF(AND('PR-RAS'!D526>0,'PR-RAS'!D914=0),1,0)","v":0},{"$f":"IF(AND('PR-RAS'!E526>0,'PR-RAS'!E914=0),1,0)","v":0}]
[213,"O.K.","Ako je iznos za šifru 5121 veći od nule, a iznos na šifri 51212 je jednak nuli, provjerite šifru 51212. Ako je njihov iznos stvarno toliki, zanemarite ovu kontrolu.",null,0,0,null,null,null,null,null,{"$f":"IF(AND('PR-RAS'!D536>0,SUM('PR-RAS'!D915:D915)=0),1,0)","v":0},{"$f":"IF(AND('PR-RAS'!E536>0,SUM('PR-RAS'!E915:E915)=0),1,0)","v":0}]
[214,"O.K.","Ako je iznos za šifru 5132 veći od nule, a iznos na šifri 51322 je jednak nuli, provjerite šifru 51322. Ako je njihov iznos stvarno toliki, zanemarite ovu kontrolu.",null,0,0,null,null,null,null,null,{"$f":"IF(AND('PR-RAS'!D539>0,SUM('PR-RAS'!D916:D916)=0),1,0)","v":0},{"$f":"IF(AND('PR-RAS'!E539>0,SUM('PR-RAS'!E916:E916)=0),1,0)","v":0}]
[215,"O.K.","Ako je iznos za šifru 5133 veći od nule, a iznos na šifri 51332 je jednak nuli, provjerite šifru 51332. Ako je njihov iznos stvarno toliki, zanemarite ovu kontrolu.",null,0,0,null,null,null,null,null,{"$f":"IF(AND('PR-RAS'!D540>0,SUM('PR-RAS'!D917:D917)=0),1,0)","v":0},{"$f":"IF(AND('PR-RAS'!E540>0,SUM('PR-RAS'!E917:E917)=0),1,0)","v":0}]
[216,"O.K.","Ako je iznos za šifru 5134 veći od nule, a iznos na šifri 51342 je jednak nuli, provjerite šifru 51342. Ako je njihov iznos stvarno toliki, zanemarite ovu kontrolu.",null,0,0,null,null,null,null,null,{"$f":"IF(AND('PR-RAS'!D541>0,SUM('PR-RAS'!D918:D918)=0),1,0)","v":0},{"$f":"IF(AND('PR-RAS'!E541>0,SUM('PR-RAS'!E918:E918)=0),1,0)","v":0}]
[217,"O.K.","Ako je iznos za šifru 5153 veći od nule, a iznos na šifri 51532 je jednak nuli, provjerite šifru 51532. Ako je njihov iznos stvarno toliki, zanemarite ovu kontrolu.",null,0,0,null,null,null,null,null,{"$f":"IF(AND('PR-RAS'!D544>0,SUM('PR-RAS'!D921:D921)=0),1,0)","v":0},{"$f":"IF(AND('PR-RAS'!E544>0,SUM('PR-RAS'!E921:E921)=0),1,0)","v":0}]
[218,"O.K.","Ako je iznos za šifru 5154 veći od nule, a iznos na šifri 51542 je jednak nuli, provjerite šifru 51542. Ako je njihov iznos stvarno toliki, zanemarite ovu kontrolu.",null,0,0,null,null,null,null,null,{"$f":"IF(AND('PR-RAS'!D545>0,SUM('PR-RAS'!D922:D922)=0),1,0)","v":0},{"$f":"IF(AND('PR-RAS'!E545>0,SUM('PR-RAS'!E922:E922)=0),1,0)","v":0}]
[219,"O.K.","Ako je iznos za šifru 5155 veći od nule, a iznos na šifri 51552 je jednak nuli, provjerite šifru 51552. Ako je njihov iznos stvarno toliki, zanemarite ovu kontrolu.",null,0,0,null,null,null,null,null,{"$f":"IF(AND('PR-RAS'!D546>0,SUM('PR-RAS'!D923:D923)=0),1,0)","v":0},{"$f":"IF(AND('PR-RAS'!E546>0,SUM('PR-RAS'!E923:E923)=0),1,0)","v":0}]
[220,"O.K.","Ako je iznos za šifru 5413 veći od nule, a iznos za šifru 54132 (otplata glavnice primljenih zajmova od međunarodnih organizacija - dugoročnih) je jednak nuli, provjerite šifru 54132. Ako je njezin iznos stvarno toliki, zanemarite ovu kontrolu.",null,0,0,null,null,null,null,null,{"$f":"IF(AND('PR-RAS'!D595>0,'PR-RAS'!D942=0),1,0)","v":0},{"$f":"IF(AND('PR-RAS'!E595>0,'PR-RAS'!E942=0),1,0)","v":0}]
[221,"O.K.","Ako je iznos za šifru 5414 veći od nule, a iznos za šifru 54142 (otplata glavnice primljenih kredita i zajmova od institucija i tijela EU - dugoročnih) je jednak nuli, provjerite šifru 54142. Ako je njezin iznos stvarno toliki, zanemarite ovu kontrolu.",null,0,0,null,null,null,null,null,{"$f":"IF(AND('PR-RAS'!D596>0,'PR-RAS'!D943=0),1,0)","v":0},{"$f":"IF(AND('PR-RAS'!E596>0,'PR-RAS'!E943=0),1,0)","v":0}]
[222,"O.K.","Ako je iznos za šifru 5415 veći od nule, a iznos za šifru 54152 (otplata glavnice primljenih zajmova od inozemnih vlada u \nEU-dugoročnih) je jednak nuli, provjerite šifru 54152. Ako je njezin iznos stvarno toliki, zanemarite ovu kontrolu.",null,0,0,null,null,null,null,null,{"$f":"IF(AND('PR-RAS'!D597>0,'PR-RAS'!D944=0),1,0)","v":0},{"$f":"IF(AND('PR-RAS'!E597>0,'PR-RAS'!E944=0),1,0)","v":0}]
[223,"O.K.","Ako je iznos za šifru 5416 veći od nule, a iznos za šifru 54162 (otplata glavnice primljenih zajmova od inozemnih vlada izvan EU - dugoročnih) je jednak nuli, provjerite šifru 54162. Ako je njezin iznos stvarno toliki, zanemarite ovu kontrolu.",null,0,0,null,null,null,null,null,{"$f":"IF(AND('PR-RAS'!D598>0,'PR-RAS'!D945=0),1,0)","v":0},{"$f":"IF(AND('PR-RAS'!E598>0,'PR-RAS'!E945=0),1,0)","v":0}]
[224,"O.K.","Ako je iznos za šifru 5423 veći od nule, a iznos za šifru 54232 (otplata glavnice primljenih zajmova od osiguravajućih društava u javnom sektoru - dugoročnih) je jednak nuli, provjerite šifru 54232. Ako je njezin iznos stvarno toliki, zanemarite ovu kontrolu.",null,0,0,null,null,null,null,null,{"$f":"IF(AND('PR-RAS'!D601>0,'PR-RAS'!D949=0),1,0)","v":0},{"$f":"IF(AND('PR-RAS'!E601>0,'PR-RAS'!E949=0),1,0)","v":0}]
[225,"O.K.","Ako je iznos za šifru 5424 veći od nule, a suma iznosa za šifre 54242 i 54243 je jednaka nuli, provjerite šifre 54242 i 54243. Ako je njihov iznos stvarno toliki, zanemarite ovu kontrolu.",null,0,0,null,null,null,null,null,{"$f":"IF(AND('PR-RAS'!D602>0,SUM('PR-RAS'!D950:D951)=0),1,0)","v":0},{"$f":"IF(AND('PR-RAS'!E602>0,SUM('PR-RAS'!E950:E951)=0),1,0)","v":0}]
[226,"O.K.","Ako je iznos za šifru 5431 veći od nule, a iznos za šifru 54312 (otplata glavnice primljenih zajmova od trgovačkih društava u javnom sektoru - dugoročnih) je jednak nuli, provjerite šifru 54312. Ako je njezin iznos stvarno toliki, zanemarite ovu kontrolu.",null,0,0,null,null,null,null,null,{"$f":"IF(AND('PR-RAS'!D604>0,'PR-RAS'!D952=0),1,0)","v":0},{"$f":"IF(AND('PR-RAS'!E604>0,'PR-RAS'!E952=0),1,0)","v":0}]
[227,"O.K.","Ako je iznos za šifru 5444 veći od nule, a iznos za šifru 54442 (otplata glavnice primljenih zajmova od tuzemnih osiguravajućih društava izvan javnog sektora - dugoročnih) je jednak nuli, provjerite šifru 54442. Ako je njezin iznos stvarno toliki, zanemarite ovu kontrolu.",null,0,0,null,null,null,null,null,{"$f":"IF(AND('PR-RAS'!D607>0,'PR-RAS'!D956=0),1,0)","v":0},{"$f":"IF(AND('PR-RAS'!E607>0,'PR-RAS'!E956=0),1,0)","v":0}]
[228,"O.K.","Ako je iznos za šifru 5445 veći od nule, a suma iznosa za šifre 54452 i 54453 je jednaka nuli, provjerite šifre 54452 i 54453. Ako je njihov iznos stvarno toliki, zanemarite ovu kontrolu.",null,0,0,null,null,null,null,null,{"$f":"IF(AND('PR-RAS'!D608>0,SUM('PR-RAS'!D957:D958)=0),1,0)","v":0},{"$f":"IF(AND('PR-RAS'!E608>0,SUM('PR-RAS'!E957:E958)=0),1,0)","v":0}]
[229,"O.K.","Ako je iznos za šifru 5447 veći od nule, a iznos za šifru 54472 (otplata glavnice primljenih zajmova od inozemnih osiguravajućih društava - dugoročnih) je jednak nuli, provjerite šifru 54472. Ako je njezin iznos stvarno toliki, zanemarite ovu kontrolu.",null,0,0,null,null,null,null,null,{"$f":"IF(AND('PR-RAS'!D610>0,'PR-RAS'!D962=0),1,0)","v":0},{"$f":"IF(AND('PR-RAS'!E610>0,'PR-RAS'!E962=0),1,0)","v":0}]
[230,"O.K.","Ako je iznos za šifru 5448 veći od nule, a suma iznosa za šifre 54482 i 54483 je jednaka nuli, provjerite šifre 54482 i 54483. Ako je njihov iznos stvarno toliki, zanemarite ovu kontrolu.",null,0,0,null,null,null,null,null,{"$f":"IF(AND('PR-RAS'!D611>0,SUM('PR-RAS'!D963:D964)=0),1,0)","v":0},{"$f":"IF(AND('PR-RAS'!E611>0,SUM('PR-RAS'!E963:E964)=0),1,0)","v":0}]
[231,"O.K.","Ako je iznos za šifru 5453 veći od nule, a iznos za šifru 54532 (otplata glavnice primljenih zajmova od tuzemnih trgovačkih društava izvan javnog sektora - dugoročnih) je jednak nuli, provjerite šifru 54532 Ako je njezin iznos stvarno toliki, zanemarite ovu kontrolu.",null,0,0,null,null,null,null,null,{"$f":"IF(AND('PR-RAS'!D613>0,'PR-RAS'!D965=0),1,0)","v":0},{"$f":"IF(AND('PR-RAS'!E613>0,'PR-RAS'!E965=0),1,0)","v":0}]
[232,"O.K.","Ako je iznos za šifru 5454 veći od nule, a iznos za šifru 54542 (otplata glavnice primljenih zajmova od tuzemnih obrtnika - dugoročnih) je jednak nuli, provjerite šifru 54542. Ako je njezin iznos stvarno toliki, zanemarite ovu kontrolu.",null,0,0,null,null,null,null,null,{"$f":"IF(AND('PR-RAS'!D614>0,'PR-RAS'!D966=0),1,0)","v":0},{"$f":"IF(AND('PR-RAS'!E614>0,'PR-RAS'!E966=0),1,0)","v":0}]
[233,"O.K.","Ako je iznos za šifru 5455 veći od nule, a iznos za šifru 54552 (otplata glavnice primljenih zajmova od inozemnih trgovačkih društava - dugoročnih) je jednak nuli, provjerite šifru 54552. Ako je njezin iznos stvarno toliki, zanemarite ovu kontrolu.",null,0,0,null,null,null,null,null,{"$f":"IF(AND('PR-RAS'!D615>0,'PR-RAS'!D967=0),1,0)","v":0},{"$f":"IF(AND('PR-RAS'!E615>0,'PR-RAS'!E967=0),1,0)","v":0}]
[234,"O.K.","Ako je iznos za šifru 5531 veći od nule, a iznos za šifru 55312 (izdaci za otplatu glavnice za izdane ostale vrijednosne papire u zemlji - dugoročne) je jednak nuli, provjerite šifru 55312. Ako je njezin iznos stvarno toliki, zanemarite ovu kontrolu.",null,0,0,null,null,null,null,null,{"$f":"IF(AND('PR-RAS'!D633>0,'PR-RAS'!D982=0),1,0)","v":0},{"$f":"IF(AND('PR-RAS'!E633>0,'PR-RAS'!E982=0),1,0)","v":0}]
[235,"O.K.","Kontrola upozorenja na popunjenost podataka o stanju na računu, priljevima i odljevima s računa (šifre: 11P, 11-dugov., 11-potraž.). Kontrola upozorava ako su u nekoj koloni podataka stanja na računu i/ili priljevi te odljevi s računa nula što je vrlo malo vjerojatno. Popunite podatke ako ih niste popunili.",null,0,0,null,null,null,null,null,{"$f":"IF(AND(J3=\"DA\",MAX('PR-RAS'!D6:D651)=0,MIN('PR-RAS'!D6:D651)=0),1,0)","v":0},{"$f":"IF(AND(J3=\"DA\",MAX('PR-RAS'!E6:E651)=0,MIN('PR-RAS'!E6:E651)=0),1,0)","v":0}]
[236,"O.K.","Višak prihoda preneseni i manjak prihoda preneseni ne mogu istovremeno biti popunjeni niti u jednom stupcu financijskog izvještaja. Ako ova kontrola javlja pogrešku značu da su istovremeno popunjene šifre 92211 i 92221, ili su istovremeno popunjene šifre 92212 i 92222, ili su istovremeno popunjene šifre 92213 i 92223 u jednom od stupaca (tekuća ili prethodna godina).",null,0,0,null,{"$f":"IF(OR('PR-RAS'!D292*'PR-RAS'!D293>0,'PR-RAS'!D409*'PR-RAS'!D410>0,'PR-RAS'!D637*'PR-RAS'!D638>0),1,0)","v":0},{"$f":"IF(OR('PR-RAS'!E292*'PR-RAS'!E293>0,'PR-RAS'!E409*'PR-RAS'!E410>0,'PR-RAS'!E637*'PR-RAS'!E638>0),1,0)","v":0}]
[258,{"$f":"IF(E274=1,\"Pogreška\",IF(F274=1,\"Provjera\",\"O.K.\"))","v":"O.K."},"Preneseni viškovi po kategorijama (šifra 92211, šifra 92212, šifra 92213) odnosno preneseni manjkovi po kategorijama (šifra 92221, šifra 92222, šifra 92223) moraju biti veći ili jednaki nuli u oba stupca podataka.",null,0,{"$f":"MAX(L274:O274)","v":0},{"$f":"IF(AND(J3=\"DA\",OR(ISBLANK('PR-RAS'!D292),ISBLANK('PR-RAS'!D409),ISBLANK('PR-RAS'!D637),ISBLANK('PR-RAS'!D293),ISBLANK('PR-RAS'!D410),ISBLANK('PR-RAS'!D638))),1,0)","v":0},{"$f":"IF(AND(J3=\"DA\",OR(ISBLANK('PR-RAS'!E292),ISBLANK('PR-RAS'!E409),ISBLANK('PR-RAS'!E637),ISBLANK('PR-RAS'!E293),ISBLANK('PR-RAS'!E410),ISBLANK('PR-RAS'!E638))),1,0)","v":0}]
[237,"O.K.","Kontrola na broj zaposlenih. Broj zaposlenih ni na jednoj od šifri Z006 do Z009 ne može biti iznad 100.000. Takav obrazac je u grešci. Osim toga, samo nekolicina obveznika (RKP 174, 713, 1222, 47107) mogu imati broj zaposlenih u tijelima veći od 10.000, a broj zaposlenih kod korisnika veći od 35.000. Oni su isključeni iz ove kontrole. Ostali obveznici su u grešci ako imaju na bilo kojoj poziciji broj zaposleni veći od ovoga. Osim ovoga, ova kontrola će javiti upozorenje ako je broj zaposlenih kod nekih od obveznika veći od 1.000. Upozorenje možete zanemariti ako je broj zaposlenih ispravno upisan.",null,{"$f":"MAX(G275:K275)","v":0},0,{"$f":"IF(AND(OR(MAX('PR-RAS'!D653:E653,'PR-RAS'!D655:E655)>10000,MAX('PR-RAS'!D654:E654,'PR-RAS'!D656:E656)>35000),O3<>174,O3<>713,O3<>1222,O3<>47107),1,0)","v":0},{"$f":"IF(MAX('PR-RAS'!D653:E656)>100000,1,0)","v":0},null,null,null,{"$f":"IF(MAX('PR-RAS'!D653:E656)>1000,1,0)","v":0}]
[257,"O.K.","Ako ova kontrola javlja grešku znači da je na nekoj šifri upisana negativna vrijednost. Ovaj obrazac ne smije sadržavati negativne vrijednosti.",null,{"$f":"MAX(G276:K276)","v":0},0,{"$f":"IF(MIN('PR-RAS'!D6:E992)<-0.001,1,0)","v":0}]
["BILANCA",null,null,null,{"$f":"SUM(E278:E310)","v":0},{"$f":"SUM(F278:F310)","v":0}]
[1,{"$f":"IF(E278=1,\"Pogreška\",IF(F278=1,\"Provjera\",\"O.K.\"))","v":"O.K."},"Ovo je osnovna kontrola u Bilanci: Imovina = Obveze i vlastiti izvori (šifra B001 = šifra B003).",null,{"$f":"MAX(G278:K278)","v":0},{"$f":"MAX(L278:O278)","v":0},{"$f":"IF(ABS(BILANCA!D6-BILANCA!D175)>0.001,1,0)","v":0},{"$f":"IF(ABS(BILANCA!E6-BILANCA!E175)>0.001,1,0)","v":0}]
[26,{"$f":"IF(E279=1,\"Pogreška\",IF(F279=1,\"Provjera\",\"O.K.\"))","v":"O.K."},"Obveznici razina 41 i 42 ne smiju imati popunjene šifre: 167 i 16721. Iznimka su obveznici s RKP-om 23911 i 25843.",null,{"$f":"MAX(G279:K279)","v":0},{"$f":"MAX(L279:O279)","v":0},{"$f":"IF(AND(OR(I3=41,I3=42),O3<>23911,O3<>25843,MAX(BILANCA!D161:E161,BILANCA!D286:E286)>0),1,0)","v":0}]
[27,"O.K.","Obveznici razine 23 ne smiju imati popunjene šifre 16721 i 23956.",null,0,0,{"$f":"IF(AND(I3=23,MAX(BILANCA!D286:E286,BILANCA!D300:E300)>0),1,0)","v":0}]
[2,{"$f":"IF(E281=1,\"Pogreška\",IF(F281=1,\"Provjera\",\"O.K.\"))","v":"O.K."},"Šifre 92211 i 92221 ne mogu biti popunjene istovremeno ni u jednom stupcu obrasca.",null,{"$f":"MAX(G281:K281)","v":0},0,{"$f":"IF(AND(BILANCA!D247<>0,BILANCA!D251<>0),1,0)","v":0},{"$f":"IF(AND(BILANCA!E247<>0,BILANCA!E251<>0),1,0)","v":0}]
[3,"O.K.","Šifre 92212 i 92222 ne mogu biti popunjene istovremeno ni u jednom stupcu obrasca.",null,0,0,{"$f":"IF(AND(BILANCA!D248<>0,BILANCA!D252<>0),1,0)","v":0},{"$f":"IF(AND(BILANCA!E248<>0,BILANCA!E252<>0),1,0)","v":0}]
[4,"O.K.","Šifre 92213 i 92223 ne mogu biti popunjene istovremeno ni u jednom stupcu obrasca.",null,0,0,{"$f":"IF(AND(BILANCA!D249<>0,BILANCA!D253<>0),1,0)","v":0},{"$f":"IF(AND(BILANCA!E249<>0,BILANCA!E253<>0),1,0)","v":0}]
[5,"O.K.","Samo šifre 9, 91, 911 i 922 mogu biti i negativne. Ako ova kontrola javlja pogrešku znači da je upisana negativna vrijednost za šifru za koju to nije dopušteno.",null,0,0,{"$f":"IF(MIN(BILANCA!D6:E236,BILANCA!D240:E244,BILANCA!D246:E322)<0,1,0)","v":0}]
[30,{"$f":"IF(E285=1,\"Pogreška\",IF(F285=1,\"Provjera\",\"O.K.\"))","v":"O.K."},"Vrijednost šifre 129 mora biti jednaka zbroju vrijednosti šifri 12911 do 12941 u oba stupca podataka.",null,{"$f":"MAX(G285:K285)","v":0},{"$f":"MAX(L285:O285)","v":0},{"$f":"IF(ABS(BILANCA!D86-SUM(BILANCA!D268:'BILANCA'!D273))>0.001,1,0)","v":0},{"$f":"IF(ABS(BILANCA!E86-SUM(BILANCA!E268:'BILANCA'!E273))>0.001,1,0)","v":0}]
[28,"O.K.","Vrijednost šifre 1637 mora biti jednaka zbroju vrijednosti šifri 16371 do 16378 u oba stupca podataka.",null,0,0,{"$f":"IF(ABS(BILANCA!D156-SUM(BILANCA!D274:'BILANCA'!D281))>0.001,1,0)","v":0},{"$f":"IF(ABS(BILANCA!E156-SUM(BILANCA!E274:'BILANCA'!E281))>0.001,1,0)","v":0}]
[29,"O.K.","Zbroj šifri 16631 do 16643 je samo dio šifre 166 i mora biti manji ili jednak šifri 166 u oba stupca podataka.",null,0,0,{"$f":"IF(ROUND(BILANCA!D160,2)<ROUND(SUM(BILANCA!D282:'BILANCA'!D285),2),1,0)","v":0},{"$f":"IF(ROUND(BILANCA!E160,2)<ROUND(SUM(BILANCA!E282:'BILANCA'!E285),2),1,0)","v":0}]
[18,{"$f":"IF(E288=1,\"Pogreška\",IF(F288=1,\"Provjera\",\"O.K.\"))","v":"O.K."},"Vrijednost šifre 16721 mora biti manja ili jednaka vrijednosti šifre 167. Ako je šifra 16721 veća kontrola javlja grešku.",null,{"$f":"MAX(G288:K288)","v":0},0,{"$f":"IF(ROUND(BILANCA!D286,2)>ROUND(BILANCA!D161,2),1,0)","v":0},{"$f":"IF(ROUND(BILANCA!E286,2)>ROUND(BILANCA!E161,2),1,0)","v":0}]
[19,"O.K.","Zbroj šifri dio 13 D + dio 13 N mora biti jednak zbroju šifri 13X1 + 13X2 u oba stupca podataka.",null,0,0,{"$f":"IF(ABS(BILANCA!D88+BILANCA!D106-BILANCA!D262-BILANCA!D263)>0.001,1,0)","v":0},{"$f":"IF(ABS(BILANCA!E88+BILANCA!E106-BILANCA!E262-BILANCA!E263)>0.001,1,0)","v":0}]
[20,"O.K.","Zbroj šifri dio 16 D + dio 16 N mora biti jednak zbroju šifri 161 do 163 + 164 do 168 u oba stupca podataka.",null,0,0,{"$f":"IF(ABS(SUM(BILANCA!D147:D149,BILANCA!D158:D162)-BILANCA!D264-BILANCA!D265)>0.001,1,0)","v":0},{"$f":"IF(ABS(SUM(BILANCA!E147:E149,BILANCA!E158:E162)-BILANCA!E264-BILANCA!E265)>0.001,1,0)","v":0}]
[21,"O.K.","Zbroj šifri dio 17 D + dio 17 N mora biti jednak zbroju šifri 171 do 174 u oba stupca podataka.",null,0,0,{"$f":"IF(ABS(SUM(BILANCA!D165:D168)-BILANCA!D266-BILANCA!D267)>0.001,1,0)","v":0},{"$f":"IF(ABS(SUM(BILANCA!E165:E168)-BILANCA!E266-BILANCA!E267)>0.001,1,0)","v":0}]
[31,"O.K.","Zbroj šifri: 23951 do 23958 je samo dio šifre 239 i mora biti manji ili jednak u oba stupca podataka.",null,0,0,{"$f":"IF(ROUND(BILANCA!D188,2)<ROUND(SUM(BILANCA!D295:'BILANCA'!D302),2),1,0)","v":0},{"$f":"IF(ROUND(BILANCA!E188,2)<ROUND(SUM(BILANCA!E295:'BILANCA'!E302),2),1,0)","v":0}]
[32,"O.K.","Zbroj šifri: 26223+26224 je samo dio šifre 2622 i mora biti manji ili jednak u oba stupca podataka.",null,0,0,{"$f":"IF(ROUND(BILANCA!D208,2)<ROUND(SUM(BILANCA!D303:'BILANCA'!D304),2),1,0)","v":0},{"$f":"IF(ROUND(BILANCA!E208,2)<ROUND(SUM(BILANCA!E303:'BILANCA'!E304),2),1,0)","v":0}]
[33,"O.K.","Šifra 26233 je samo dio šifre 2623 i mora joj biti manja ili jednaka u oba stupca podataka.",null,0,0,{"$f":"IF(ROUND(BILANCA!D209,2)<ROUND(BILANCA!D305,2),1,0)","v":0},{"$f":"IF(ROUND(BILANCA!E209,2)<ROUND(BILANCA!E305,2),1,0)","v":0}]
[34,"O.K.","Zbroj šifri: 26243+26244 je samo dio šifre 2624 i mora biti manji ili jednak u oba stupca podataka.",null,0,0,{"$f":"IF(ROUND(BILANCA!D210,2)<ROUND(SUM(BILANCA!D306:'BILANCA'!D307),2),1,0)","v":0},{"$f":"IF(ROUND(BILANCA!E210,2)<ROUND(SUM(BILANCA!E306:'BILANCA'!E307),2),1,0)","v":0}]
[35,{"$f":"IF(E296=1,\"Pogreška\",IF(F296=1,\"Provjera\",\"O.K.\"))","v":"O.K."},"Šifra 26314 je samo dio šifre 2631 i mora joj biti manja ili jednaka u oba stupca podataka.",null,{"$f":"MAX(G296:K296)","v":0},{"$f":"MAX(L296:O296)","v":0},{"$f":"IF(ROUND(BILANCA!D211,2)<ROUND(BILANCA!D308,2),1,0)","v":0},{"$f":"IF(ROUND(BILANCA!E211,2)<ROUND(BILANCA!E308,2),1,0)","v":0}]
[36,"O.K.","Zbroj šifri: 26433+26434 je samo dio šifre 2643 i mora biti manji ili jednak u oba stupca podataka.",null,0,0,{"$f":"IF(ROUND(BILANCA!D212,2)<ROUND(SUM(BILANCA!D309:'BILANCA'!D310),2),1,0)","v":0},{"$f":"IF(ROUND(BILANCA!E212,2)<ROUND(SUM(BILANCA!E309:'BILANCA'!E310),2),1,0)","v":0}]
[37,"O.K.","Šifra 26443 je samo dio šifre 2644 i mora joj biti manja ili jednaka u oba stupca podataka.",null,0,0,{"$f":"IF(ROUND(BILANCA!D213,2)<ROUND(BILANCA!D311,2),1,0)","v":0},{"$f":"IF(ROUND(BILANCA!E213,2)<ROUND(BILANCA!E311,2),1,0)","v":0}]
[38,{"$f":"IF(E299=1,\"Pogreška\",IF(F299=1,\"Provjera\",\"O.K.\"))","v":"O.K."},"Zbroj šifri: 26453+26454 je samo dio šifre 2645 i mora biti manji ili jednak u oba stupca podataka.",null,{"$f":"MAX(G299:K299)","v":0},{"$f":"MAX(L299:O299)","v":0},{"$f":"IF(ROUND(BILANCA!D214,2)<ROUND(SUM(BILANCA!D312:'BILANCA'!D313),2),1,0)","v":0},{"$f":"IF(ROUND(BILANCA!E214,2)<ROUND(SUM(BILANCA!E312:'BILANCA'!E313),2),1,0)","v":0}]
[39,"O.K.","Zbroj šifri: 26463+26464 je samo dio šifre 2646 i mora biti manji ili jednak u oba stupca podataka.",null,0,0,{"$f":"IF(ROUND(BILANCA!D229,2)<ROUND(SUM(BILANCA!D314:'BILANCA'!D315),2),1,0)","v":0},{"$f":"IF(ROUND(BILANCA!E229,2)<ROUND(SUM(BILANCA!E314:'BILANCA'!E315),2),1,0)","v":0}]
[40,"O.K.","Šifra 26473 je samo dio šifre 2647 i mora joj biti manja ili jednaka u oba stupca podataka.",null,0,0,{"$f":"IF(ROUND(BILANCA!D230,2)<ROUND(BILANCA!D316,2),1,0)","v":0},{"$f":"IF(ROUND(BILANCA!E230,2)<ROUND(BILANCA!E316,2),1,0)","v":0}]
[41,"O.K.","Zbroj šifri 26483+26484 je samo dio šifre 2648 i mora biti manji ili jednak u oba stupca podataka. ",null,0,0,{"$f":"IF(ROUND(BILANCA!D231,2)<ROUND(SUM(BILANCA!D317:'BILANCA'!D318),2),1,0)","v":0},{"$f":"IF(ROUND(BILANCA!E231,2)<ROUND(SUM(BILANCA!E317:'BILANCA'!E318),2),1,0)","v":0}]
[42,"O.K.","Šifra 26534 je samo dio šifre 2653 i mora joj biti manja ili jednaka u oba stupca podataka.",null,0,0,{"$f":"IF(ROUND(BILANCA!D215,2)<ROUND(BILANCA!D319,2),1,0)","v":0},{"$f":"IF(ROUND(BILANCA!E215,2)<ROUND(BILANCA!E319,2),1,0)","v":0}]
[43,{"$f":"IF(E304=1,\"Pogreška\",IF(F304=1,\"Provjera\",\"O.K.\"))","v":"O.K."},"Šifra 26544 je samo dio šifre 2654 i mora joj biti manja ili jednaka u oba stupca podataka.",null,{"$f":"MAX(G304:K304)","v":0},{"$f":"MAX(L304:O304)","v":0},{"$f":"IF(ROUND(BILANCA!D216,2)<ROUND(BILANCA!D320,2),1,0)","v":0},{"$f":"IF(ROUND(BILANCA!E216,2)<ROUND(BILANCA!E320,2),1,0)","v":0}]
[44,"O.K.","Šifra 26554 je samo dio šifre 2655 i mora joj biti manja ili jednaka u oba stupca podataka.",null,0,0,{"$f":"IF(ROUND(BILANCA!D232,2)<ROUND(BILANCA!D321,2),1,0)","v":0},{"$f":"IF(ROUND(BILANCA!E232,2)<ROUND(BILANCA!E321,2),1,0)","v":0}]
[45,{"$f":"IF(E306=1,\"Pogreška\",IF(F306=1,\"Provjera\",\"O.K.\"))","v":"O.K."},"Šifra 26564 je samo dio šifre 2656 i mora joj biti manja ili jednaka u oba stupca podataka.",null,{"$f":"MAX(G306:K306)","v":0},{"$f":"MAX(L306:O306)","v":0},{"$f":"IF(ROUND(BILANCA!D233,2)<ROUND(BILANCA!D322,2),1,0)","v":0},{"$f":"IF(ROUND(BILANCA!E233,2)<ROUND(BILANCA!E322,2),1,0)","v":0}]
[22,"O.K.","Šifra 23 mora biti jednaka zbroju šifri: 'dio 23 D' + 'dio 23 N' u oba stupca podataka.",null,0,0,{"$f":"IF(ABS(BILANCA!D177-BILANCA!D287-BILANCA!D288)>0.001,1,0)","v":0},{"$f":"IF(ABS(BILANCA!E177-BILANCA!E287-BILANCA!E288)>0.001,1,0)","v":0}]
[23,"O.K.","Šifra 24 mora biti jednaka zbroju šifri: 'dio 24 D' + 'dio 24 N' u oba stupca podataka.",null,0,0,{"$f":"IF(ABS(BILANCA!D189-BILANCA!D289-BILANCA!D290)>0.001,1,0)","v":0},{"$f":"IF(ABS(BILANCA!E189-BILANCA!E289-BILANCA!E290)>0.001,1,0)","v":0}]
[24,"O.K.","Šifra 25 mora biti jednaka zbroju šifri: 'dio 25 D' + 'dio 25 N' u oba stupca podataka.",null,0,0,{"$f":"IF(ABS(BILANCA!D190-BILANCA!D291-BILANCA!D292)>0.001,1,0)","v":0},{"$f":"IF(ABS(BILANCA!E190-BILANCA!E291-BILANCA!E292)>0.001,1,0)","v":0}]
[25,"O.K.","Šifra 26 mora biti jednaka zbroju šifri: 'dio 26 D' + 'dio 26 N' u oba stupca podataka.",null,0,0,{"$f":"IF(ABS(BILANCA!D206-BILANCA!D293-BILANCA!D294)>0.001,1,0)","v":0},{"$f":"IF(ABS(BILANCA!E206-BILANCA!E293-BILANCA!E294)>0.001,1,0)","v":0}]
["OBVEZE",null,null,null,{"$f":"SUM(E312:E313)","v":0},{"$f":"SUM(F312:F313)","v":0}]
[1,{"$f":"IF(E312=1,\"Pogreška\",IF(F312=1,\"Provjera\",\"O.K.\"))","v":"O.K."},"Ako ova kontrola javlja grešku znači da je na nekoj šifri upisana negativna vrijednost. Ovaj obrazac ne smije sadržavati negativne vrijednosti.",null,{"$f":"MAX(G312:K312)","v":0},{"$f":"MAX(L312:O312)","v":0},{"$f":"IF(MIN(OBVEZE!D5:D105)<-0.001,1,0)","v":0}]
[2,"O.K.","Mora biti zadovoljena i kontrola: šifra V006 = V007+V009 ili drukčije rečeno, ukupno stanje svih obveza na kraju razdoblja (šifra V006) mora biti jednako zbroju dospjelih obveza (šifra V007) i nedospjelih obveza (šifra V009).",null,0,0,{"$f":"IF(ROUND(OBVEZE!D42,2)<>ROUND(OBVEZE!D43+OBVEZE!D101,2),1,0)","v":0}]
["P-VRIO",null,null,null,{"$f":"SUM(E315:E315)","v":0},{"$f":"SUM(F315:F315)","v":0}]
[1,{"$f":"IF(E315=1,\"Pogreška\",IF(F315=1,\"Provjera\",\"O.K.\"))","v":"O.K."},"Ako ova kontrola javlja grešku znači da je na nekoj šifri upisana negativna vrijednost. Ovaj obrazac ne smije sadržavati negativne vrijednosti.",null,{"$f":"MAX(G315:K315)","v":0},{"$f":"MAX(L315:O315)","v":0},{"$f":"IF(MIN('P-VRIO'!D5:E48)<-0.001,1,0)","v":0}]
["RAS - funkcijski",null,null,null,{"$f":"SUM(E317)","v":0},0]
[1,{"$f":"IF(E317=1,\"Pogreška\",IF(F317=1,\"Provjera\",\"O.K.\"))","v":"O.K."},"Ako ova kontrola javlja grešku znači da je na nekoj šifri upisana negativna vrijednost. Ovaj obrazac ne smije sadržavati negativne vrijednosti.",null,{"$f":"MAX(G317:K317)","v":0},{"$f":"MAX(L317:O317)","v":0},{"$f":"IF(MIN('RAS-funkcijski'!D5:E141)<-0.001,1,0)","v":0}]
[]
[]
[]
[]
[]
[]
[]
[]
[]
[]
[]
[]
[]
[]
[]
[]
[]
[]
[]
[]
[]
[]
[]
[]
[]
[]
[]
[]
[]
[]
[]
[]
[]
[]
[]
[]
[]
[]
[]
[]
[]
[]
[]
[]
[]
[]
[]
[]
[]
[]
[]
[]
[]
[]
[]
[]
[]
[]
[]
[]
[]
[]
[]
[]
[]
[]
[]
[]
[]
[]
[]
[]
[]
[]
[]
[]
[]
[]
[]
[]
[]
[]
[]
[]
[]
[]
[]
[]
[]
[]
[]
[]
[]
[]
[]
[]
[]
[]
[]
[]
[]
[]
[]
[]
[]
[]
[]
[]
[]
[]
[]
[]
[]
[]
[]
[]
[]
[]
[]
[]
[]
[]
[]
[]
[]
[]
[]
[]
[]
[]
[]
[]
[]
[]
[]
[]
[]
[]
[]
[]
[]
[]
[]
[]
[]
[]
[]
[]
[]
[]
[]
[]
[]
[]
[]
[]
[]
[]
[]
[]
[]
[]
[]
[]
[]
[]
[]
[]
[]
[]
[]
[]
[]
[]
[]
[]
[]
[]
[]
[]
[]
[]
[]
[]
[]
[]
[]
[]
[]
[]
[]
[]
[]
[]
[]
[]
[]
[]
[]
[]
[]
[]
[]
[]
[]
[]
[]
[]
[]
[]
[]
[]
[]
[]
[]
[]
[]
[]
[]
[]
[]
[]
[]
[]
[]
[]
[]
[]
[]
[]
[]
[]
[]
[]
[]
[]
[]
[]
[]
[]
[]
[]
[]
[]
[]
[]
[]
[]
[]
[]
[]
[]
[]
[]
[]
[]
[]
[]
[]
[]
[]
[]
[]
[]
[]
[]
[]
[]
[]
[]
[]
[]
[]
[]
[]
[]
[]
[]
[]
[]
[]
[]
[]
[]
[]
[]
[]
[]
[]
[]
[]
[]
[]
[]
[]
[]
[]
[]
[]
[]
[]
[]
[]
[]
[]
[]
[]
[]
[]
[]
[]
[]
[]
[]
[]
[]
[]
[]
[]
[]
[]
[]
[]
[]
[]
[]
[]
[]
[]
[]
[]
[]
[]
[]
[]
[]
[]
[]
[]
[]
[]
[]
[]
[]
[]
[]
[]
[]
[]
[]
[]
[]
[]
[]
[]
[]
[]
[]
[]
[]
[]
[]
[]
[]
[]
[]
[]
[]
[]
[]
[]
[]
[]
[]
[]
[]
[]
[]
[]
[]
[]
[]
[]
[]
[]
[]
[]
[]
[]
[]
[]
[]
[]
[]
[]
[]
[]
[]
[]
[]
[]
[]
[]
[]
[]
[]
[]
[]
[]
[]
[]
[]
[]
[]
[]
[]
[]
[]
[]
[]
[]
[]
[]
[]
[]
[]
[]
[]
[]
[]
[]
[]
[]
[]
[]
[]
[]
[]
[]
[]
[]
[]
[]
[]
[]
[]
[]
[]
[]
[]
[]
[]
[]
[]
[]
[]
[]
[]
[]
[]
[]
[]
[]
[]
[]
[]
[]
[]
[]
[]
[]
[]
[]
[]
[]
[]
[]
[]
[]
[]
[]
[]
[]
[]
[]
[]
[]
[]
[]
[]
[]
[]
[]
[]
[]
[]
[]
[]
[]
[]
[]
[]
[]
[]
[]
[]
[]
[]
[]
[]
[]
[]
[]
[]
[]
[]
[]
[]
[]
[]
[]
[]
[]
[]
[]
[]
[]
[]
[]
[]
[]
[]
[]
[]
[]
[]
[]
[]
[]
[]
[]
[]
[]
[]
[]
[]
[]
[]
[]
[]
[]
[]
[]
[]
[]
[]
[]
[]
[]
[]
[]
[]
[]
[]
[]
[]
[]
[]
[]
[]
[]
[]
[]
[]
[]
[]
[]
[]
[]
[]
[]
[]
[]
[]
[]
[]
[]
[]
[]
[]
[]
[]
[]
[]
[]
[]
[]
[]
[]
[]
[]
[]
[]
[]
[]
[]
[]
[]
[]
[]
[]
[]
[]
[]
[]
[]
[]
[]
[]
[]
[]
[]
[]
[]
[]
[]
[]
[]
[]
[]
[]
[]
[]
[]
[]
[]
[]
[]
[]
[]
[]
[]
[]
[]
[]
[]
[]
[]
[]
[]
[]
[]
[]
[]
[]
[]
[]
[]
[]
[]
[]
[]
[]
[]
[]
[]
[]
[]
[]
[]
[]
[]
[]
[]
[]
[]
[]
[]
[]
[]
[]
[]
[]
[]
[]
[]
[]
[]
[]
[]
[]
[]
[]
[]
[]
[]
[]
[]
[]
[]
[]
[]
[]
[]
[]
[]
[]
[]
[]
[]
[]
[]
[]
[]
[]
[]
[]
[]
[]
[]
[]
[]
[]
[]
[]
[]
[]
[]
[]
[]
[]
[]
[]
[]
[]
[]
[]
[]
[]
[]
[]
[]
[]
[]
[]
[]
[]
[]
[]
[]
[]
[]
[]
[]
[]
[]
[]
[]
[]
[]
[]
[]
[]
[]
[]
[]
[]
[]
[]
[]
[]
[]
[]
[]
[]
[]
[]
[]
[]
[]
[]
[]
[]
[]
[]
[]
[]
[]
[]
[]
[]
[]
[]
[]
[]
[]
[]
[]
[]
[]
[]
[]
[]
[]
[]
[]
[]
[]
[]
[]
[]
[]
[]
[]
[]
[]
[]
[]
[]
[]
[]
[]
[]
[]
[]
[]
[]
[]
[]
[]
[]
[]
[]
[]
[]
[]
[]
[]
[]
[]
[]
[]
[]
[]
[]
[]
[]
[]
[]
[]
[]
[]
[]
[]
[]
[]
[]
[]
[]
[]
[]
[]
[]
[]
[]
[]
[]
[]
[]
[]
[]
[]
[]
[]
[]
[]
[]
[]
[]
[]
[]
[]
[]
[]
[]
[]
[]
[]
[]
[]
[]
[]
[]
[]
[]
[]
[]
[]
[]
[]
[]
[]
[]
[]
[]
[]
[]
[]
[]
[]
[]
[]
[]
[]
[]
[]
[]
[]
[]
[]
[]
[]
[]
[]
[]
[]
[]
[]
[]
[]
[]
[]
[]
[]
[]
[]
[]
[]
[]
[]
[]
[]
[]
[]
[]
[]
[]
[]
[]
[]
[]
[]
[]
[]
[]
[]
[]
[]
[]
[]
[]
[]
[]
[]
[]
[]
[]
[]
[]
[]
[]
[]
[]
[]
[]
[]
[]
[]
[]
[]
[]
[]
[]
[]
[]
[]
[]
[]
[]
[]
[]
[]
[]
[]
[]
[]
[]
[]
[]
[]
[]
[]
[]
[]
[]
[]
[]
[]
[]
[]
[]
[]
[]
[]
[]
[]
[]
[]
[]
[]
[]
[]
[]
[]
[]
[]
[]
[]
[]
[]
[]
[]
[]
[]
[]
[]
[]
[]
[]
[]
[]
[]
[]
[]
[]
[]
[]
[]
[]
[]
[]
[]
[]
[]
[]
[]
[]
[]
[]
[]
[]
[]
[]
[]
[]
[]
[]
[]
[]
[]
[]
[]
[]
[]
[]
[]
[]
[]
[]
[]
[]
[]
[]
[]
[]
[]
[]
[]
[]
[]
[]
[]
[]
[]
[]
[]
[]
[]
[]
[]
[]
[]
[]
[]
[]
[]
[]
[]
[]
[]
[]
[]
[]
[]
[]
[]
[]
[]
[]
[]
[]
[]
[]
[]
[]
[]
[]
[]
[]
[null,null,null,null,null,null,null,null,null,{"$f":"IF(AND(C1447=0,D1447),1,0)","v":1},null,{"$f":"IF(C1447<>0,1,0)","v":0}]
[null,null,null,null,null,null,null,null,null,"=IF(AND(C1430=0;D1430);1;0)"]
[]
[null,null,null,null,null,null,null,null,null,null,{"$f":"IF(ABS(OBVEZE!D42-OBVEZE!D43-OBVEZE!D101)>0,1,0)","v":1}]

{"sheet":"Promjene","index":9,"n_rows":55,"n_cols":2,"rows_kept":55,"cut":false,"hidden":false,"merged":[[54,1,54,2],[52,1,52,2],[51,1,51,2],[20,1,20,2],[21,1,21,2],[22,1,22,2],[23,1,23,2],[24,1,24,2],[25,1,25,2],[26,1,26,2],[27,1,27,2],[28,1,28,2],[29,1,29,2],[40,1,40,2],[41,1,41,2],[30,1,30,2],[31,1,31,2],[32,1,32,2],[15,1,15,2],[16,1,16,2],[17,1,17,2],[18,1,18,2],[19,1,19,2],[10,1,10,2],[11,1,11,2],[12,1,12,2],[13,1,13,2],[14,1,14,2],[5,1,5,2],[6,1,6,2],[7,1,7,2],[8,1,8,2],[9,1,9,2],[0,0,0,2],[1,0,1,2],[2,1,2,2],[3,1,3,2],[4,1,4,2],[33,1,33,2],[34,1,34,2],[35,1,35,2],[36,1,36,2],[37,1,37,2],[53,1,53,2],[38,1,38,2],[39,1,39,2],[50,1,50,2],[49,1,49,2],[47,1,47,2],[42,1,42,2],[43,1,43,2],[44,1,44,2],[45,1,45,2],[46,1,46,2],[48,1,48,2]]}
["PROMJENE"]
["Na ovom radnom listu dat će se popis svih, i najmanjih promjena Excel datoteke iz verzije u verziju (bilo da su nastale zbog promjene zakonskih propisa, ispravka pogrešaka u Excel datoteci, dodatnim kontrolama ili poboljšanjima obrasca. "]
["Verzija","Opis promjene u odnosu na prethodnu verziju"]
["2.0.0.","Svi obrasci proračuna i proračunskih korisnika objedinjeni su zbog potreba kontrola između obrazaca te lakšu kontrolu obveznosti (koja razina je obvezna podnositi koji obrazac)."]
["2.0.0.","Uvedena su polja \"Datum od\" i \"Datum do\" svakog pojedinog razdoblja kako bi se moglo posebno prepoznati obveznike koji nisu poslovali cijelo navedeno razdoblje (novootvoreni obveznici i obveznici koji zbog statusnih promjena gube pravnu osobnost)."]
["2.0.0.","Programskim kućama koje izrađuju aplikacije za punjenje obrazaca olakšan je postao jer se za sve obrasce i sve vrste posla unosi jedno jedinstveno zaglavlje, u svakom obrascu AOP oznake upisane su u koloni \"C\", dok svi iznosi (bez obzira na broj kolona) počinju u koloni \"D\", u 12. retku. Od ovoga se više neće odstupati osim ako ne bude nikakve druge mogućnosti da se unesu potrebne promjene."]
["2.0.1.","Popravljeni su pogrešni naslovi nekih obrazaca. Dodana je kontrola da se u poštanski broj ne može unijeti nešto što nije broj između 10000 i 60000. Popravljena je kontrola upozorenja na S-PR-RAS obrascu koja je krivo izračunavala razradu konta 32 (kontrola pod rednim brojem 90)"]
["2.0.2.","Ispravljena kontrola u PR-RAS obrascu koja je AOP 010 zbrajala u AOP oznaku 003, umjesto da je oduzimala od sume svih ostalih AOP oznaka."]
["2.0.3.","Ispravljena kontrola upozorenja na broj zaposlenih u PR-RAS obrascu preko 1000 kada to nije. Ispravljena kontrola koja je za polugodište javljala pogrešku da se za razinu 23 ne predaje obrazac Obveze. Svi obveznici (ne više samo oni kojima je razdjel ujedno i glava) razina 11 i 12 trebaju upisati razdjel, a ostali obveznici ne mogu."]
["2.0.3.","Upisom razine 11 ili 12 u zaglavlju obrasca obveze automatski se pojavljuje oznaka da je obrazac mjesečni, a ne kvartalni. Promijenjeni su opisi obveznosti predaje prema razinama, grupirani na mjesečnu obvezu, kvartalnu, polugodišnju i godišnju. Na obrazac obveze, na dnu obrasca dodana crta za potpis zakonskog predstavnika (za dostavu obrasca nadležnim ministarstvima)."]
["2.0.3.","Proširene upute tekstom o upotrebi ove Excel datoteke za dostavu podataka nadležnim ministarstvima ili za neke druge potrebe."]
["2.0.4.","Popravljena kontrola broj 36 u PR-RAS-u koja je provjeravala pogrešne AOP pozicije. \nPopravljena kontrola koja je javljala pogrešku ako je bio popunjen polugodišnji obrazac NT za razine 22 i 23."]
["2.0.5.","Popravljena kontrola broj 9 u kojoj je za razinu 23 traženo da bude upisan i obrazac NT, a stvarno ne treba biti."]
["2.0.6.","Popravljene kontrole broj 7 i 12 (obveznost predaje po razinama 13 i 42) te kontrola 63 - iznosi planiranog za razdoblje i planiranog za cijelu godinu u obrascu PR-RAS moraju biti identični kod godišnjeg obrasca, a za ostala razdoblja iznos planirano za razdoblje mora biti manji ili jednak planiranom za cijelu godinu. "]
["2.0.7.","Popravljena je kontrola broj 63 koja govori da planirano za razdoblje ne može biti veće od planiranoga za godinu. Iznimno, ovakvo stanje dopušteno je kod sumarnih AOP oznaka u kojima se neka vrijednost oduzima (primjerice AOP oznaka 222 ili 223) jer se računaju automatski."]
["2.0.8.","Popravljene kontrole popunjenosti obrazaca za razine 13, 31, 41 i 42 na godišnjoj razini. Dodan je razdjel 095, Izbrisan je razdjel 065 (sa starim nazivom, ostao samo s novim), promijenjen opis kontrole P-VRIO obrasca (naglašavanje da se oznaka DA ili NE na referentnoj stranici mora upisati ručno)."]
["2.0.9.","Dodana mogućnost odabira svih razdoblje za 2010. godinu, dodani novi razdjeli za 2010."]
["2.1.0.","Popravljen je prikaz datuma od i do na nekim obrascima koji se je poremetio ubacivanjem novih razdoblja za 2010."]
["2.1.0.","Dorađena su poslovna pravila o popunjavanju obrasca, kolona planirano za razdoblje i planirano ukupno popunjavaju se samo na trećoj razini kontnog plana, a ne na četvrtoj kako je bilo ranije, te je obrazac dorađen u skladu s tim pravilom."]
["2.5.0.","Omogućen je unos samo obrasca Obveze (mjesečne) za razdoblja siječanj i veljaču 2011. Ostali obrasci će se mijenjati i čekaju se izmjene. Zbog toga je Obveze dobio novu šifru vrste posla."]
["2.9.0.","Omogućen unos obrazaca za I. kvartal 2011. godine - nepotpune kontrole."]
["2.9.1.","Omogućen unos obrasca Obveze za travanj 2011. godine"]
["4.0.0.","Novi obrazac od 1.1.2015. - prva verzija obrasca, omogućen samo unos mjesečnog obrasca Obveze za siječanj 2015. godine"]
["4.0.1.","Omogućen unos mjesečnih obveza za veljaču. Ostale vrste obrazaca još nemaju kontrole."]
["4.0.2.","Ugrađene su sve kontrole za sve obrasce. Omogućen je unos za sva razdoblja u 2015. godini. Dodan je opis novosti i promjena kod predaje u Upute. Ažuriran je popis razdjela za 2015. godinu."]
["4.0.3.","Ispravljena kontrola broj 23. Pogrešno je upozoravala na AOP 646, umjesto na 649."]
["4.0.4.","Kontrola upozorenja broj 156 je obrisana jer više nema u dodatnim podacima razrade koja je bila prije za ovaj konto. Ispravljena je kontrola 147 koja nije dopuštala da razina 11 ima upisan broj zaposlenih u tijelima s obzirom da nadležna ministarstva imaju te zaposlene, a oni također predaju izvještaje razine 11. Ispravljena je kontrola 58. koja nije dobro radila na koloni tekuće godine. Ispravljena je automatska suma na AOP oznaci 224 u koloni prethodne godine u Bilanci. Unesene su sitne ispravke \"tipfelera\" u nekim kontrolama."]
["4.0.5.","Opis AOP oznake 639 je ispravljen, glasio je \"Rashodi budućih razdoblja\", novi opis je \"Unaprijed plaćeni rashodi budućih razdoblja\". Ispravljena pogrešna formula na AOP-u 407. Ispravljena je pogrešna formula u kontroli 028."]
["4.0.6.","Ispravljene su pogreške u obrascu Obveze zbog kojih se podaci pod AOP oznakama 095 do 101 nisu uopće učitavali u aplikaciju. Iz tog razloga neće se više moći učitati bilo koji obrazac iz verzije niže od 4.0.6. Dodane su nova kontrola broj 52 i 53  (svim bivšim kontrolama iza 51 povećan je broj za 2). Ispravljen je opis što se sumira pod AOP oznakama 405 i 406. Formula je bila dobra. Ispravljen je i opis i formula za sumu na AOP oznaci 407. Proširena je lista AOP-a koji nesmiju biti popunjeni za razinu 22 i 23 - dodani su AOP-i 132 i 133 u kontrolu 153 (bivša kontrola 151). Adresa e-pošte za kontakt u zaglavlju stavljena je kao obvezan podatak zbog česte potrebe kontaktiranja obveznika, a koje je nemoguće kontaktirati putem telefona."]
["4.0.7.","Kontrola 153 podijeljena je na dvije kontrole, jer se zabrane popunjavanja nekih AOP pozicija razlikuju kod razine 22 i 23. Za razinu 23 dopušteno je popunjavanje AOP pozicija 128 do 133."]
["4.0.8.","Omogućen je unos mjesečnih Obveza i za razinu 11. Nova Bilanca za 2015. još nije ugrađena u obrazac."]
["4.0.9.","Ispravljena je kontrola broj 66 koja je pogrešno glasila \"AOP 423 mora biti jedna sumi AOP-a 496+498\", ispravno je da treba glasiti \"AOP423 mora biti jednak sumi AOP-a 496 do 498\", tj. i AOP oznaka 497 ulazi u kontrolu sume. Ispravljen je i opus i formula za ovu kontrolu."]
["4.1.0.","Ugrađena je nova Bilanca koja vrijedi od 2015. godine. Kontrole 15 i 16 su dorađene i spojene u jednu (kontrola 15, a stara kontrola 16 je obrisana te je broj kontrola manji). S proširenjem broja AOP oznaka u dodatnim podacima u Bilanci promijenjeni su opisi kontrola 224 do 232 u Bilanci, tj. kontrole se nisu mijenjali ali su opisi prilagođeni novim AOP oznakama. Dodano je 7 novih kontrola na obrazac Bilancu. Kako se obrazac Bilanca promijenio, dodana mu je nova (stara) šifra vrste posla 152."]
["4.2.0.","Ukinuti su mjesečni obrasci Obveze za sve vrste obveznika. Izmjijenjen je opis AOP oznake 639 u PR-RAS-u te AOP 001 u obrascu Obveze. Obrazac obveze predaje se za cijelo razdoblje, od početka godine do datuma izvještavanja, ne samo za kvartal (tj. obveze na dan 30.06 predaju se za razdoblje 1.1. do 30.06. ne više za razdoblje 1.4. do 30.06.). Izmijenjena je kontrola 153. Dorađena je kontrola broj 16. Promijenjena je obveznost po razdobljima i razinama u odnosu na prethodnu godinu. U kontrole 148 do 156 dopuštene su iznimke na neke AOP oznake te za neke korisnike."]
["4.2.1.","Ispravljen je opis vrste posla na samom radnom listu izvještaja o Obvezama (VP 159, a ne VP 160). Ispravljen je datum koji se prikazuje na izvještaju o obvezama, nije od 1. u mjesecu do kraja mjesece već od 1. siječnja do kraja razdoblja jer više mjesečnih obveza nema. Ova izmjena ne utječe na funkcionalnost obrasca, napravljena je samo iz razloga da ne zbunjuje korisnike, tj. da ne smatraju kako se radi o mjesečnom izvještaju obveze. Ako ste već izvještaj ispunili u verziji 4.2.0. nije potrebno prebacivati u novu verziju."]
["4.2.2.","Dodan komentar u obrazac Obveze na AOP oznaku 001. Ispravljen pogrešan opis AOP oznake 639. Ispravljena kontrola 13 koja je pogreškom uspoređivala AOP 639 iz PR-RAS obrasca i 159 iz Bilance. Ispravno je da je uspoređuje sa AOP oznakom 158 iz Bilance."]
["4.2.3.","Ispravljena je kontrola broj 16 koja nije uzimala u obzir iznos prikazan na AOP oznaci 234 PR-RAS-a. Ispravljen opis kontrole 13 koji je kod zadnje izmjene greškom ostao 159. Obveznici koji nisu imali popunjen iznos na AOP 234 ni u jednoj godini mogu predati i na starijoj verziji obrasca jer im ova kontrola neće javljati pogrešku."]
["5.0.1.","Nova verzija obrasca za 2017. Promijenio se broj AOP oznaka kod 3 obrasca pa su svi obrasci i kontrole novi."]
["5.0.2.","Dorađene kontrole izuzetaka koji mogu imati popunjen AOP 031 (a time i 024) za razinu 11, tj. kontrola 154 je podijeljena na 154. i 155., a kontrola 157 na 158 i 159, pa se i broj kontrola povećao za 2. Ispravljena kontrola 14. umjesto AOP-a 159 kontrolira se AOP 158. Popravljene neke kontrole koje ne dopuštaju da neka razina ima popunjen neki određeni AOP."]
["5.0.3.","Na listu AOP oznaka koje ne mogu biti popunjene kod razine 23 dodane su AOP oznake: 069 do 073 i 241 do 245. Obrazac eventualno popunjen u verziji 5.0.2. može se predati ako je zadovoljen ovaj uvjet da za razinu 23 nisu popunjene te AOP oznake. Ispravljena kontrola 172, greškom je javljala pogrešku ako je popunjen AOP 695, a ne 685."]
["5.0.4.","Ispravljene kontrole 202 i 203 koje su provjeravale pogrešne AOP oznake u koloni tekuće godine. Ponovo je ispravljena kontrola 177, tj. isključen je AOP 246 iz liste onih koji ne mogu biti popunjeni. Popravljena je kontrola 168 koja se javljala kod razine 12 umjesto kod razine 13. Kontrole na razinu 12 nisu radile ako je bila upisana razina 11 i kad je izvještaj imao oznaku da vrijedi i kao konsolidirani.Ispravljena je kontrola 205 koja je greškom uspoređivala AOP-e 210 i 729, a treba 211 i 729."]
["5.0.5.","RKP 47115 dodan na listu izuzetaka za nepopunjavanje AOP oznake 579 za razinu 12. Dorađena kontrola popunjenosti općih podataka - zakonski predstavnik mora biti upisan inače Excel javlja pogrešku. Dodana su razdoblja za 2018. godinu. Obveznicima razine 21 i 31 dopušten je unos podataka na AOP oznake 222 do 227. Popravljena kontrola 271 koja je u stupcu tekućeg razdoblja uspoređivala krive AOP oznake."]
["5.0.6.","RKP 1087 dodan na listu izuzetaka za nepopunjavanje AOP oznake 474 do 478. Dorađen je opis kontrole 3, da dodatno pojasni oznaku \"DA\" za konsolidaciju jer korisnici proračuna razine 11 vrlo često pokušavaju upisati \"DA\" iako nisu ni obveznici predaje konsolidiranih izvještaja. Skriveni su redovi i stupci koji služe kao popis mogućih šifri, a koji su zbunjivali neke obveznike. Skriveni su stupci i redovi u obrascu verzije 5.0.5. koji se ne bi trebali vidjeti, a sadrže šifarnike potrebne za rad Kontrola, ne umanjuju funkcionalnost Excel-a, ali zbunjuju korisnike."]
["5.0.7.","Dodana nova razdoblja za 2019. godinu, dodane nove kontrole broj 254 na PR-RAS obrazac koja ne dopušta da višak i manjak prihoda preneseni budu istovremeno popunjeni. Sitne promjene uputa. Dodani razdjeli 011 i 255, brisan razdjel 256."]
["6.0.0.","Dodano je nekoliko novih AOP pozicija unutar obrasca Bilanca, za informaciju su ozančene plavom bojom. Shodno izmjenama obrasca Bilance izmijenjeni su i redni brojevi AOP oznaka i kontrole. Dodana razdoblja za 2020. godinu. Dodan novi razdjel 039 - Hrvatska vatrogasna zajednica."]
["7.0.0.","Nova verzija obrasca. Najveća promjena je micanje AOP-a i uvođenje polja Šifre kao jedinstvenu stavku za potrebe obrade unesenih podataka u web aplikaciji. Također, promjene su zahvatile sve listove ovog Excel dokumenta te su iste sad u skladu s web aplikacijom. Izbačen je dio vezan za unos općih podataka (koji se sad povlači iz aplikacije prilikom predaje dokumenta), smanjen je prikaz pojedinih podataka na samim obrascima te su pojedine kontrole uklonjenje. "]
["7.3.0.","Dodane neke nove i izmijenjene postojeće kontrole na popunjenost nekih šifri po razinama. Dodavanje novih kontrola na broj zaposlenih u tijelima i kod korisnika, ispravke nekih kontrola koje nisu dobro radile u Excel-u. Dorađena kontrola na mogućnost upisa minus stavaka u PR-RAS-u. Ispravljene kontrole 178 i 191 koje su za razine 11 i 22 javljale pogrešku i kada su podaci bili ispravni."]
["8.0.0.","Nova verzija obrasca. Najveća promjena je uklanjanje AOP oznake i uvođenje polja Šifre kao jedinstvene stavke za potrebe obrade unesenih podataka u web aplikaciji. \nDodatna značajna promjena odnosi se na unos novčanih iznosa koji se u obrascima iskazuju punim brojem sa dvije decimale u službenoj valuti Republike Hrvatske. \nIzbačen je dio podataka vezan za unos Općih podataka o proračunu, proračunskom i izvanproračunskom korisniku na Referentnoj stranici (podaci se sada za svaki subjekt povlače iz Registra proračunskih i izvanproračunskih korisnika u samoj aplikaciji prilikom predaje obrazaca). Isto tako, smanjen je prikaz pojedinih podataka na samim obrascima te su uklonjene pojedine kontrole. \nPromjene su zahvatile sve listove ovog Excel dokumenta te su u skladu s web aplikacijom."]
["8.0.1.","Korekcije postojećih kontrola. Korekcije formula određenih šifri. Referentna stranica prilagođena za ispis.\nPromjene su zahvatile listove RefStr, PR-RAS i Kont."]
["8.0.2.","Dorađen list Upute. Dodane nedostajale formule za izračun indeksa na listu PR-RAS."]
["8.0.3.","Korekcija postojećih kontrola (kontrole broj 156 i 160)."]
["8.1.0.","Korekcija postojećih kontrola (ažurirane kontrole broj 136, 148, 247), brisana kontrola broj 188 i dodana nova kontrola broj 257."]
["8.1.1.","Korekcija postojećih kontrola (ažurirane kontrole broj 158 i 161)."]
["8.1.2.","Korekcija postojećih kontrola (ažurirane kontrole broj 155 i 159)."]
["8.1.3.","Dodane nove kontrole: kontrola broj 5 između različitih obrazaca, kontrola broj 258 na obrascu PR-RAS, kontrole broj 30, 31, 32, 33, 34, 35, 36, 37, 38, 39, 40, 41, 42, 43, 44 i 45 na obrascu BILANCA."]